{"text_format":"1","workbook":"xlsx","n_sheets":13,"sheets":["Process & Requirements","Application","Tracking Sheet","Participation Agreement","Lighting Input Form","Lighting Retrofit Summary","Lighting Retrofit Worksheet","Verification Report","Payment Request","Pay Letter - Assignee","Pay Letter - Customer","Input Tables","Rebate Tables"],"not_rendered":{"charts":0,"images":2,"macros":1,"external_links":0,"defined_names":491,"comments":9,"pivot_tables":1},"unopened":[],"bounds":{"document_bytes":16777216,"sheet_cells":100000,"rows_first":2000,"rows_last":500,"rows_between":2000,"halvings":0,"cell_chars":16384,"cell_head_chars":4096},"cells_cut":0,"cells_raw":0,"read":"whole","date_system":"1900"}

{"sheet":"Process & Requirements","index":0,"n_rows":76,"n_cols":9,"rows_kept":76,"cut":false,"hidden":true,"merged":[[57,5,58,20],[60,5,61,20],[64,5,66,20],[68,5,69,20],[76,2,76,19],[75,2,75,20],[2,2,2,20],[8,4,10,20],[11,6,12,20],[21,5,23,20],[20,5,20,20],[29,8,30,19],[31,8,32,19],[52,5,55,20],[40,4,41,20],[35,7,36,20],[38,4,38,20],[43,5,47,20],[48,4,49,20]]}
[]
[]
[null,null,{"$f":"BannerText","v":"Energy Services  ●  eebiz@snopud.com  ●  www.snopud.com"}]
[]
[null,null,"Process & Requirements (Updated 1/1/23)"]
[]
[]
[null,null,"1)","Determine the project scope"]
[null,null,null,null,"First, determine which lights at your facility you would like to upgrade and the proposed fixtures you would like to replace them with. As a Public Utility, PUD must remain product and vendor neutral so we are unable to make specific recommendations on how you should complete your lighting project. However, if you would like some help making these important decisions here are a few resources available to you: "]
[]
[]
[null,null,null,null,null,"a)","Free consultation - If you are unsure where to begin or have questions around our incentive process, please reach out to: \n          John Petosa (P) (425) 530-6603 (E) jfpetosa@snopud.com"]
[]
[null,null,null,null,null,null,"OR"]
[null,null,null,null,null,"b)","Review the list of Lighting Contractors who have recently worked in our area."]
[null,null,null,null,"Minimum lighting eligibility requirements:"]
[null,null,null,null,"●","UL, ETL or CSA Listed"]
[null,null,null,null,"●","Minimum 5 Year Warranty"]
[null,null,null,null,"●","Power Factor ≥ 0.9"]
[null,null,null,null,"Minimum networked / luminaire level lighting controls eligibility requirements:"]
[null,null,null,null,"●","Networked/luminaire Lighting Control products must be listed on the DesignLights Consortium® Qualified Products List to qualify."]
[null,null,null,null,"●","All Networked/Luminaire Level Lighting Control projects require a description of the proposed controls strategy. \nPLEASE NOTE: LLLC/Networked Controls must include Task Tuning (Maximum output of 80%) and at least  2 additional strategies to qualify. \n    Ex: Task tuning + Occupancy Sensing + Daylight Harvesting        "]
[]
[]
[null,null,"2)","Gather the necessary documents and upload for PUD review"]
[null,null,null,null,"In addition to filling out this workbook, please also gather the following documents:"]
[null,null,null,null,null,"a)","Product specification sheets (\"Spec Sheets\")"]
[null,null,null,null,null,null,null,"Required for each unique model # being used on the project. "]
[null,null,null,null,null,null,null,"●","When possible, please highlight on the sheet the minimum eligibility requirements (i.e. warranty, power factor, uL/ETL, etc...)"]
[null,null,null,null,null,null,null,"●","If a spec sheet has multiple options listed (i.e. color temperatures, wattage packages, distribution types, please mark, highlight, or otherwise indicate your desired option(s) on the sheet. "]
[]
[null,null,null,null,null,null,null,"●","In projects where multiple spec sheets are required, please assign a simple, unique ID to each spec sheet for ease of reference and combine them into a single pdf file. Ex: Spec 1A, Spec 1B, Spec 2A, etc…"]
[]
[null,null,null,null,null,"b)","Proposal/Bid"]
[null,null,null,null,null,"c)","[Conditional] Customer acknowledgement"]
[null,null,null,null,null,null,null,"If you are a contractor submitting a project on your customers behalf, please also provide an acknowledgement from the customer that they intend to proceed with the project. This can be a signed application, signed bid, or something to the same effect. "]
[]
[null,null,null,null,"Once you have gathered the necessary documents, please visit our commercial lighting page and upload your documents to complete your application."]
[null,null,null,null,"Our team will follow up with next steps. If you have not participated in our programs recently, we will also request a copy of your company's IRS W9 form."]
[null,null,"3)","PUD review, approval and project go-ahead"]
[null,null,null,null,"Our staff will review your submitted documents for accuracy and completeness. If your submission is missing any required information, or any of the information contained is incorrect you will be informed and your application will be placed on hold until the correct information is provided. "]
[]
[null,null,null,null,"Project authorization and signing the project participation agreement"]
[null,null,null,null,null,"Once your project has been reviewed and approved, an authorized participation agreement will be created and sent to the Customer for review and signature. The signed agreement must be returned to the PUD by the sign back deadline in order to secure incentive funding. The agreement will include a summary of the financial incentive offered, estimated savings, who receives payment (customer or customer's assigned Payee), terms and conditions, and project verification requirements. Program funding is limited and project incentives are subject to budget availability. \nFunding will not be reserved for your project until we receive a signed agreement."]
[]
[]
[]
[]
[null,null,null,null,"Once we have receive the signed participation agreement, we will issue a project go-ahead, after which you may purchase equipment and begin work on your project."]
[]
[null,null,"4)","Important dates, project completion and changes to the authorized scope "]
[null,null,null,null,"Project expiration"]
[null,null,null,null,null,"A typical lighting project will be given 91 days (13 Weeks) from the date of authorization to complete. If your project will need more time, please let us know at the time of project submission. If unforeseen issues arise and you need more time to complete your project, please reach out to us with a written request PRIOR to the expiration date. We will review our case and determine whether to grant your project a deadline extension. Deadline extensions are subject to funding availability. No extensions will be granted to projects that have received a bonus or other special \"Due By\" dates."]
[]
[]
[]
[null,null,null,null,"Changes to the authorized scope "]
[null,null,null,null,null,"Any changes to the project after the original scope has been approved that results in an increase to the savings or incentive must be approved by the PUD to ensure eligibility and funding availability, unless stated otherwise by PUD. "]
[]
[null,null,null,null,"Project completion"]
[null,null,null,null,null,"Once your project is complete, please send us a copy of the final invoice, and (if applicable), any as built spec sheets and this workbook updated with any as built changes. "]
[]
[null,null,"5)","Project close out and payment"]
[null,null,null,null,"Post verification"]
[null,null,null,null,null,"Once the new lights are installed and operating, the PUD may require an on-site verification or photos to ensure the scope of the project has been completed as authorized in the participation agreement. For projects where equipment or systems might be concealed prior to completion or in a limited access location the PUD may request a site verification(s) during installation to review progress."]
[]
[]
[null,null,null,null,"Payment"]
[null,null,null,null,null,"Once your project has been approved for payment, we will notify you via email. A check will be mailed to the address provided on the application unless otherwise requested by the customer. Please allow 2-6 weeks for payment delivery"]
[]
[null,null,null,null,"Post Project"]
[null,null,null,null,null,"The PUD reserves the right to review system or facility energy usage after the project has been completed."]
[]
[]
[]
[null,null,"If you have questions, please contact Snohomish PUD at EEBIZ@snopud.com"]

{"sheet":"Application","index":1,"n_rows":122,"n_cols":68,"rows_kept":122,"cut":false,"hidden":false,"merged":[[4,13,5,39],[18,34,18,35],[18,36,18,37],[18,24,18,25],[14,18,14,24],[39,20,39,35],[24,37,24,41],[18,22,18,23],[24,15,24,18],[24,19,24,24],[30,40,30,44],[39,36,39,40],[39,41,39,42],[39,43,39,44],[32,40,32,44],[33,40,33,44],[30,3,33,39],[43,31,43,38],[51,36,51,40],[51,20,51,35],[51,3,51,19],[45,3,45,8],[45,9,45,18],[43,39,43,44],[51,43,51,44],[51,41,51,42],[43,14,43,24],[43,25,43,30],[43,3,43,13],[11,41,11,42],[14,38,14,40],[14,41,14,42],[11,3,11,15],[14,3,14,6],[11,16,11,31],[13,33,13,37],[11,32,11,40],[13,30,13,32],[14,7,14,17],[14,30,14,32],[14,33,14,37],[14,25,14,29],[41,14,41,24],[18,41,18,42],[18,38,18,40],[18,43,18,44],[27,3,27,41],[31,40,31,44],[39,3,39,19],[24,42,24,44],[18,10,18,11],[18,12,18,13],[24,25,24,29],[24,30,24,36],[41,3,41,13],[41,31,41,38],[41,25,41,30],[41,39,41,44],[79,67,79,68],[78,67,78,68],[78,1,78,44],[68,3,68,44],[78,62,78,63],[78,64,78,65],[78,60,78,61],[73,48,73,51],[53,25,53,30],[53,31,53,38],[53,39,53,44],[67,3,67,44],[66,3,66,44],[61,3,61,4],[59,17,59,29],[59,3,59,16],[59,30,59,42],[59,43,59,44],[61,5,61,44],[53,3,53,13],[53,14,53,24],[2,2,2,45],[6,2,7,31],[13,18,13,24],[16,3,17,10],[16,14,17,22],[16,26,17,34],[16,38,17,40],[16,41,17,42],[16,43,17,44],[13,38,13,40],[14,43,14,44],[13,41,13,42],[10,43,10,44],[10,41,10,42],[11,43,11,44],[4,2,5,11]]}
[]
[]
[null,null,"Energy Services  ●  eebiz@snopud.com  ●  www.snopud.com"]
[]
[null,null,"Application",null,null,null,null,null,null,null,null,null,null,"Alert! This workbook requires macros in order to function properly. \nFor instructions on how to enable macros please click here"]
[]
[null,null,"For Lighting Retrofits in Commercial & Industrial Facilities"]
[]
[null,null,null,"Facility Information",null,null,null,null,null,null,null,null,null,null,null,null,null,null,null,null,null,null,null,null,null,null,null,null,null,null,null,null,null,null,null,null,null,null,null,null,null,null,null,null,"*Indicates required field"]
[]
[null,null,null," Facility / Building Name*:",null,null,null,null,null,null,null,null,null,null,null,null," Facility Address*:",null,null,null,null,null,null,null,null,null,null,null,null,null,null,null," City/Town*:",null,null,null,null,null,null,null,null,"State",null," Zip Code*:"]
[null,null,null,null,null,null,null,null,null,null,null,null,null,null,null,null,null,null,null,null,null,null,null,null,null,null,null,null,null,null,null,null,null,null,null,null,null,null,null,null,null,"WA"]
[]
[null,null,null," Facility Type*",null,null,null," Premise Type*",null,null,null,null,null,null,null,null,null,null," Account Number(s):",null,null,null,null,null,null," PUD Meter(s):",null,null,null,null," Est. kWh/yr:",null,null," Approx. Ft2:",null,null,null,null," Multi-tenant:",null,null," A/C*:",null," Heat Source*:"]
[null,null,null,1,null,null,null,"[Select Premise Type]"]
[]
[null,null,null," Hours of Occupancy (Main)*:",null,null,null,null,null,null,null,"M","-","F"," Hours of Occupancy (Alt 1):",null,null,null,null,null,null,null,null,null,"-",null," Hours of Occupancy (Alt 2):",null,null,null,null,null,null,null,null,null,"-",null,"Holidays/Yr*:",null,null,"24/7:",null,"Occupied Hours/Year:",null,null,null,null,"24/7 Flag"]
[]
[null,null,null,8,":",0,"AM","-",6,":",0,null,"PM",null,null,null,":",null,null,"-",null,":",null,null,null,null,null,null,":",null,null,"-",null,":",null,null,null,null,10,null,null,null,null,{"$f":"IF(App_247Flag=TRUE,8760-24*App_DaysClosed,\nROUND(SUM(WeeklyBurnHours)/7*365-App_DaysClosed*PrimaryHoursPerDay,-1))","v":2510},null,null,null,null,false]
[]
[]
[null,null,null,"Project Information"]
[]
[null,null,null,null,null,null,null,null,null,null,null,null,null,null,null,"Est. Start Date:",null,null,null,"Est. End Date:",null,null,null,null,null,"Installer*:",null,null,null,null,"Project Cost:",null,null,null,null,null,null,"Est. PUD Incentive:",null,null,null,null,"Est. Annual Savings ($):"]
[null,null,null,null,null,null,null,null,null,null,null,null,null,null,null,null,null,null,null,null,null,null,null,null,null,null,null,null,null,null,{"$f":"IFERROR(IF(TotalCost=0,\"\",TotalCost),\"\")","v":""},null,null,null,null,null,null,{"$f":"IFERROR(IF(IncentiveAmount=0,\"\",IncentiveAmount),\"\")","v":""},null,null,null,null,{"$f":"IF(EstAnnualCostSavings=0,\"\",EstAnnualCostSavings)","v":""}]
[null,null,null,null,null,null,null,null,null,null,null,null,null,null,null,null,null,null,null,null,null,null,null,null,null,null,null,null,null,null,null,null,"Looking for a Lighting Contractor? Click Here",null,null,null,null,null,null,null,null,null,null,null,{"$f":"IF(PromoInputValue=\"\",\"\",\nIF(PromoCodeValid=\"Valid\",\"Promo Code Active! \" & PromoDeadline,\"Code Not Valid\"))","v":""}]
[null,null,null," Assignment of Funds?"]
[null,null,null,"The customer may choose to assign their incentive funds to their contractor/distributor in order to reduce the amount owed on the final invoice.\nWill this project include an Assignment of Funds?",null,null,null,null,null,null,null,null,null,null,null,null,null,null,null,null,null,null,null,null,null,null,null,null,null,null,null,null,null,null,null,null,null,null,null,null,null,null,null,"Yes","No"]
[]
[null,null,null," Project Development Incentive (PDI)"]
[null,null,null,{"$f":"AW32&\"The incentive will be paid at a rate of $\"&PDIrate_Base&\"/kWh based on the final project savings plus an additional $\"&PDIrate_Networked&\"/kWh for savings from networked lighting controls or $\"&PDIrate_LLLC&\"/kWh from luminaire level lighting controls. Minimum of $\"&ProjDevMin&\" per project (up to 100% of project cost if paid to customer), no maximum cap.\"","v":"In addition to the incentive for energy efficiency upgrades, PUD is now offering a supplemental project development incentive to offset administrative costs associated with participating in our programs. A project development incentive will be paid to the company that is primarily responsible for filling out this workbook, assembling the required documents and submitting the complete application packet. The incentive will be paid at a rate of $0.02/kWh based on the final project savings plus an additional $0.01/kWh for savings from networked lighting controls or $0.015/kWh from luminaire level lighting controls. Minimum of $50 per project (up to 100% of project cost if paid to customer), no maximum cap."},null,null,null,null,null,null,null,null,null,null,null,null,null,null,null,null,null,null,null,null,null,null,null,null,null,null,null,null,null,null,null,null,null,null,null,null,"Est. Project Development Incentive",null,null,null,null,null,null,null,"PDI Explainer Text"]
[null,null,null,null,null,null,null,null,null,null,null,null,null,null,null,null,null,null,null,null,null,null,null,null,null,null,null,null,null,null,null,null,null,null,null,null,null,null,null,null,{"$f":"IF(TotalCost=\"\",\"\",ProjDevIncentive)","v":50},null,null,null,null,null,null,null,"In addition to the incentive for energy efficiency upgrades, PUD is now offering a supplemental project development incentive to offset administrative costs associated with participating in our programs. A project development incentive will be paid to the company that is primarily responsible for filling out this workbook, assembling the required documents and submitting the complete application packet. "]
[null,null,null,null,null,null,null,null,null,null,null,null,null,null,null,null,null,null,null,null,null,null,null,null,null,null,null,null,null,null,null,null,null,null,null,null,null,null,null,null,"PDI Recipient"]
[null,null,null,null,null,null,null,null,null,null,null,null,null,null,null,null,null,null,null,null,null,null,null,null,null,null,null,null,null,null,null,null,null,null,null,null,null,null,null,null,"Customer/Self Install"]
[]
[]
[null,null,null,"Customer Information"]
[]
[null,null,null," Business Name (as it appears on IRS W-9)*",null,null,null,null,null,null,null,null,null,null,null,null,null,null,null,null," Payment Address (check if same as above)*",null,null,null,null,null,null,null,null,null,null,null,null,null,null,null,{"$f":"IF(App_SameAddressFlag=TRUE,\" City/Town\",\" City/Town*\")","v":" City/Town*"},null,null,null,null,{"$f":"IF(App_SameAddressFlag=TRUE,\"State\",\"State*\")","v":"State*"},null,{"$f":"IF(App_SameAddressFlag=TRUE,\" Zip Code\",\" Zip Code*\")","v":" Zip Code*"},null,null,null,null,"Payment Address Flag"]
[null,null,null,null,null,null,null,null,null,null,null,null,null,null,null,null,null,null,null,null,null,null,null,null,null,null,null,null,null,null,null,null,null,null,null,null,null,null,null,null,null,null,null,null,null,null,null,null,false]
[null,null,null," Primary Contact/Signing Authority*:",null,null,null,null,null,null,null,null,null,null," Title:",null,null,null,null,null,null,null,null,null,null," Phone*:",null,null,null,null,null," Mobile:",null,null,null,null,null,null,null," E-Mail*:"]
[]
[null,null,null," Project Contact (If different from above):",null,null,null,null,null,null,null,null,null,null," Title:",null,null,null,null,null,null,null,null,null,null," Phone:",null,null,null,null,null," Mobile:",null,null,null,null,null,null,null," E-Mail:"]
[]
[null,null,null,"Payment Preference*",null,null,null,null,null,"ACH Note (Limit 25 Characters)"]
[]
[]
[]
[null,null,null,"Contractor/Distributor Information"]
[]
[null,null,null," Business Name (as it appears on IRS W-9)*",null,null,null,null,null,null,null,null,null,null,null,null,null,null,null,null,"Business/Payment Address*",null,null,null,null,null,null,null,null,null,null,null,null,null,null,null," City/Town*",null,null,null,null,"State*",null," Zip Code*"]
[]
[null,null,null," Primary Contact*:",null,null,null,null,null,null,null,null,null,null," Title:",null,null,null,null,null,null,null,null,null,null," Phone*:",null,null,null,null,null," Mobile:",null,null,null,null,null,null,null," E-Mail*:"]
[]
[null,null,null,null,null,null,null,null,null,null,null,null,null,null,null,null,null,null,null,null,null,null,null,null,null,null,null,null,null,null,null,null,null,null,null,null,null,null,null,null,null,null,null,"NXT Level Certified Contractors Click Here:"]
[]
[null,null,null,"Application Signature"]
[]
[null,null,null," Applicant Name",null,null,null,null,null,null,null,null,null,null,null,null,null," Applicant Title",null,null,null,null,null,null,null,null,null,null,null,null," Applicant Signature",null,null,null,null,null,null,null,null,null,null,null,null," Date"]
[]
[null,null,null,"Pre-Approval Acknowledgement"]
[null,null,null,null,null,"By signing above, I acknowledge that all equipment and scope must be reviewed and approved by PUD before any purchases occur. I understand that any equipment purchased or installed prior to PUD approval will not qualify for incentives unless stated otherwise by PUD program staff. "]
[]
[]
[]
[]
[null,null,null,"If you have any questions filling out this application, please contact:"]
[null,null,null,"EEBIZ@snopud.com"]
[null,null,null,"Questions:  Call (425) 783-1012"]
[null,null,null,null,null,null,null,null,null,null,null,null,null,null,null,null,null,null,null,null,null,null,null,null,null,null,null,null,null,null,null,null,null,null,null,null,null,null,null,null,null,null,null,null,{"$f":"Version","v":"Version April 2025 - Effective Date April 1st, 2025"}]
[]
[]
[]
[null,null,null,null,null,null,null,null,null,null,null,null,null,null,null,null,null,null,null,null,null,null,null,null,null,null,null,null,null,null,null,null,null,null,null,null,null,null,null,null,null,null,null,null,null,null,null,null,"Drop Down List",null,null,null,null,"Su","M","T","W","Th","F","Sa","Su","M","T","W","Th","F","Sa"]
[null,null,null,null,null,null,null,null,null,null,null,null,null,null,null,null,null,null,null,null,null,null,null,null,null,null,null,null,null,null,null,null,null,null,null,null,null,null,null,null,null,null,null,null,null,null,null,null,"Hours","Quarters","AMPM","DaysofWeek","Primary?",{"$f":"IF($L$17=BB$74,\"SP\",\nIF($N$17=BB$74,\"EP\",\nIF($N$17=\"\",0,\nIF(OR(BA75=\"SP\",BA75=\"MP\"),\"MP\",0\n))))","v":0},"SP","MP","MP","MP","EP",0,0,"SP","MP","MP","MP","EP",0]
[null,null,null,null,null,null,null,null,null,null,null,null,null,null,null,null,null,null,null,null,null,null,null,null,null,null,null,null,null,null,null,null,null,null,null,null,null,null,null,null,null,null,null,null,null,null,null,null,1,0,"AM","M","Secondary?",{"$f":"IF($X$17=BB$74,\"SS\",\nIF($Z$17=BB$74,\"ES\",\nIF($Z$17=\"\",0,\nIF(OR(BA76=\"SS\",BA76=\"MS\"),\"MS\",0\n))))","v":0},0,0,0,0,0,0,0,0,0,0,{"$f":"IF($V$17=BM$74,\"SS\",\nIF($Z$17=BM$74,\"ES\",\nIF($Z$17=\"\",0,\nIF(OR(BL76=\"SS\",BL76=\"MS\"),\"MS\",0\n))))","v":0},{"$f":"IF($V$17=BN$74,\"SS\",\nIF($Z$17=BN$74,\"ES\",\nIF($Z$17=\"\",0,\nIF(OR(BM76=\"SS\",BM76=\"MS\"),\"MS\",0\n))))","v":0},{"$f":"IF($X$17=BO$74,\"SS\",\nIF($Z$17=BO$74,\"ES\",\nIF($Z$17=\"\",0,\nIF(OR(BN76=\"SS\",BN76=\"MS\"),\"MS\",0\n))))","v":0}]
[null,null,null,null,null,null,null,null,null,null,null,null,null,null,null,null,null,null,null,null,null,null,null,null,null,null,null,null,null,null,null,null,null,null,null,null,null,null,null,null,null,null,null,null,null,null,null,null,2,15,"PM","T","Tertiary?",{"$f":"IF($AJ$17=BB$74,\"ST\",\nIF($AL$17=BB$74,\"ET\",\nIF($Z$17=\"\",0,\nIF(OR(BA77=\"SS\",BA77=\"MS\"),\"MS\",0\n))))","v":0},0,0,0,0,0,0,0,0,0,0,0,0,0]
[null,null,null,null,null,null,null,null,null,null,null,null,null,null,null,null,null,null,null,null,null,null,null,null,null,null,null,null,null,null,null,null,null,null,null,null,null,null,null,null,null,null,null,null,null,null,null,null,3,30,null,"W"]
[null,"Drop Down List",null,null,null,null,null,null,null,null,null,null,null,null,null,null,null,null,null,null,null,null,null,null,null,null,null,null,null,null,null,null,null,null,null,null,null,null,null,null,null,null,null,null,null,null,null,null,4,45,null,"Th","Burn Hours",{"$f":"SUM(BB89:BB112)","v":0},10,10,10,10,10,0,"Primary Hours",null,"Secondary Hours",null,"Tertiary Hours",null,null,"WeeklyPeakHours"]
[null,"HeatSourceType",null,null,null,null,"OccupancyType",null,null,null,null,null,null,null,null,"BusinessType",null,null,null,null,null,null,null,null,null,"PUDStaff",null,null,null,null,null,"AccountMgrs",null,null,null,null,null,null,null,null,"City",null,null,null,"YesNo",null,null,null,5,null,null,"F","P. Start Hr",{"$f":"IF(OR(RIGHT(BB$75,1)=\"P\",RIGHT(BI$75,1)=\"P\"),$BJ$82,\n0)","v":0},8,8,8,8,8,0,{"$f":"IF(AND(D19=12),0+F19*1/60,D19+F19*1/60)","v":8},{"$f":"G19","v":"AM"},{"$f":"IF(P19=12,0+R19*1/60,P19+R19*1/60)","v":0},{"$f":"S19","v":0},{"$f":"IF(AB19=12,0+AD19*1/60,AB19+AD19*1/60)","v":0},{"$f":"AE19","v":0},null,{"$f":"SUM(BC96:BF97,BC106:BF107)","v":8}]
[null,"Electric",null,null,null,null,"Agricultural",null,null,null,null,null,null,null,null,"Dry Goods Retail",null,null,null,null,null,null,null,null,null,"Allison Grinczel",null,null,null,null,null,"Tom Hovde",null,null,null,null,null,null,null,null,"Arlington",null,null,null,"Yes",null,null,null,6,null,null,"Sa","P. End Hr",{"$f":"IF(OR(RIGHT(BB$75,1)=\"P\",RIGHT(BI$75,1)=\"P\"),$BJ$83,\n0)","v":0},18,18,18,18,18,0,{"$f":"IF(AND(I19=12,BJ81=\"AM\"),K19*1/60,I19+K19*1/60)","v":6},{"$f":"M19","v":"PM"},{"$f":"IF(AND(U19=12,BL81=\"AM\"),W19*1/60,U19+W19*1/60)","v":0},{"$f":"Y19","v":0},{"$f":"IF(AND(AG19=12,BN81=\"AM\"),AI19*1/60,AG19+AI19*1/60)","v":0},{"$f":"AK19","v":0}]
[null,"Gas",null,null,null,null,"Aircraft Hangar",null,null,null,null,null,null,null,null,"Grocery",null,null,null,null,null,null,null,null,null,"John Petosa",null,null,null,null,null,"Doug O'Donnell",null,null,null,null,null,null,null,null,"Camano Island",null,null,null,"No",null,null,null,7,null,null,"Su","P. Burn Hrs",{"$f":"BB81-BB80","v":0},{"$f":"BC81-BC80","v":10},10,10,10,10,0,{"$f":"BI80","v":8},{"$f":"IF(AND($BI$80=12,$BJ$80=\"AM\"),0,\nIF($BJ$80=\"AM\",$BI$80,\nIF(AND($BI$80=12,$BJ$80=\"PM\"),12,\nIF($BJ$80=\"PM\",$BI$80+12\n))))","v":8},{"$f":"BK80","v":0},{"$f":"IF(AND($BK$80=12,$BL$80=\"AM\"),0,\nIF($BL$80=\"AM\",$BK$80,\nIF(AND($BK$80=12,$BL$80=\"PM\"),12,\nIF($BL$80=\"PM\",$BK$80+12\n))))","v":false},{"$f":"BM80","v":0},{"$f":"IF(AND($BM$80=12,$BN$80=\"AM\"),0,\nIF($BN$80=\"AM\",$BM$80,\nIF(AND($BM$80=12,$BN$80=\"PM\"),12,\nIF($BN$80=\"PM\",$BM$80+12\n))))","v":false}]
[null,"Oil",null,null,null,null,"Airport Operations",null,null,null,null,null,null,null,null,"Office",null,null,null,null,null,null,null,null,null,"Rick Rosenkilde",null,null,null,null,null,"Shelley Pattison",null,null,null,null,null,null,null,null,"Bothell",null,null,null,null,null,null,null,8,null,null,null,"S. Start Hr",{"$f":"IF(OR(RIGHT(BB$76,1)=\"S\",RIGHT(BI$76,1)=\"S\"),$BL$82,\n0)","v":0},0,0,0,0,0,0,{"$f":"IF(AND(BJ80=\"AM\",BJ81=\"PM\",BI81<>12),BI81+12,\nIF(AND(BJ80=\"AM\",BJ81=\"AM\",BI81<=BI80),BI81+24,\nIF(AND(BJ80=\"PM\",BJ81=\"AM\"),BI81+12,\nIF(AND(BJ80=\"PM\",BJ81=\"PM\",BI81<=BI80),BI81+24,$BI$81))))","v":18},{"$f":"BI85+BJ82","v":18},{"$f":"IF(AND(BL80=\"AM\",BL81=\"PM\",BK81<>12),BK81+12,\nIF(AND(BL80=\"AM\",BL81=\"AM\",BK81<=BK80),BK81+24,\nIF(AND(BL80=\"PM\",BL81=\"AM\"),BK81+12,\nIF(AND(BL80=\"PM\",BL81=\"PM\",BK81<=BK80),BK81+24,$BK$81))))","v":0},{"$f":"BK85+BL82","v":0},{"$f":"IF(AND(BN80=\"AM\",BN81=\"PM\",BM81<>12),BM81+12,\nIF(AND(BN80=\"AM\",BN81=\"AM\",BM81<=BM80),BM81+24,\nIF(AND(BN80=\"PM\",BN81=\"AM\"),BM81+12,\nIF(AND(BN80=\"PM\",BN81=\"PM\",BM81<=BM80),BM81+24,$BK$81))))","v":0},{"$f":"BM85+BN82","v":0}]
[null,"Propane",null,null,null,null,"Animal Hospital",null,null,null,null,null,null,null,null,"Restaurant",null,null,null,null,null,null,null,null,null,"Rob Marks",null,null,null,null,null,"Chuck Peterson",null,null,null,null,null,null,null,null,"Brier",null,null,null,null,null,null,null,9,null,null,null,"S. End Hr",{"$f":"IF(OR(RIGHT(BB$76,1)=\"S\",RIGHT(BI$76,1)=\"S\"),$BL$83,\n0)","v":0},0,0,0,0,0,0]
[null,"Heat Pump - Electric",null,null,null,null,"Apartments & Condos",null,null,null,null,null,null,null,null,"Warehouse",null,null,null,null,null,null,null,null,null,"Shayne Moore",null,null,null,null,null,"John Petosa",null,null,null,null,null,null,null,null,"Darrington",null,null,null,null,null,null,null,10,null,null,null,"S. Burn Hrs",{"$f":"BB84-BB83","v":0},{"$f":"BC84-BC83","v":0},0,0,0,0,0,{"$f":"BI83-BI82","v":10},"hours/day",{"$f":"BK83-BK82","v":0},"hours/day",{"$f":"BM83-BM82","v":0},"hours/day"]
[null,"Heat Pump - Gas",null,null,null,null,"Bank",null,null,null,null,null,null,null,null,"Hospital",null,null,null,null,null,null,null,null,null,"Sinh Tran",null,null,null,null,null,"Laura Zorick",null,null,null,null,null,null,null,null,"Edmonds",null,null,null,null,null,null,null,11,null,null,null,"T. Start Hr",{"$f":"IF(OR(RIGHT(BB$77,1)=\"T\",RIGHT(BI$77,1)=\"T\"),$BN82,\n0)","v":0},0,0,0,0,0,0]
[null,"VRF",null,null,null,null,"Casino",null,null,null,null,null,null,null,null,"Hotel/Motel",null,null,null,null,null,null,null,null,null,null,null,null,null,null,null,null,null,null,null,null,null,null,null,null,"Everett",null,null,null,null,null,null,null,12,null,null,null,"T. End Hr",0,0,0,0,0,0,0]
[null,"None",null,null,null,null,"Cell Tower",null,null,null,null,null,null,null,null,"Other Health",null,null,null,null,null,null,null,null,null,null,null,null,null,null,null,null,null,null,null,null,null,null,null,null,"Gold Bar",null,null,null,null,null,null,null,null,null,null,null,"T. Burn Hrs",{"$f":"BB87-BB86","v":0},0,0,0,0,0,0]
[null,null,null,null,null,null,"Church",null,null,null,null,null,null,null,null,"School",null,null,null,null,null,null,null,null,null,null,null,null,null,null,null,null,null,null,null,null,null,null,null,null,"Granite Falls",null,null,null,null,null,null,null,null,null,null,null,0,{"$f":"IF($AW$19=TRUE,1,\nIF(AND(BB$80<=$BA89,(BB$80+BB$82)>=($BA89+1)),1+N(\"Primary\"),\nIF(AND(BH$80>$BA89,(BH$80+BH$82)>=($BA89+1+24)),1+N(\"Primary\"),\nIF(AND(BB$83<=$BA89,(BB$83+BB$85)>=($BA89+1)),1+N(\"Secondary\"),\nIF(AND(BH$83>$BA89,(BH$83+BH$85)>=($BA89+1+24)),1+N(\"Secondary\"),\nIF(AND(BB$86<=$BA89,(BB$86+BB$88)>=($BA89+1)),1+N(\"Tertiary\"),\nIF(AND(BH$86>$BA89,(BH$86+BH$88)>=($BA89+1+24)),1+N(\"Tertiary\"),\nIF(AND(ROUNDDOWN(BB$80,0)=$BA89,BB$82>0),1-(BB$80-ROUNDDOWN(BB$80,0))+IF(ROUNDDOWN(BH$81,0)-24=$BA89,(BH$81-ROUNDDOWN(BH$81,0)),0)+N(\"Primary\"),\nIF(AND(ROUNDDOWN(BB$83,0)=$BA89,BB$85>0),1-(BB$83-ROUNDDOWN(BB$83,0))+IF(ROUNDDOWN(BH$84,0)-24=$BA89,(BH$84-ROUNDDOWN(BH$84,0)),0)+N(\"Secondary\"),\nIF(AND(ROUNDDOWN(BB$86,0)=$BA89,BB$88>0),1-(BB$86-ROUNDDOWN(BB$86,0))+IF(ROUNDDOWN(BH$87,0)-24=$BA89,(BH$87-ROUNDDOWN(BH$87,0)),0)+N(\"Tertiary\"),\nIF(AND(ROUNDDOWN(BB$81,0)=$BA89,BB$82>0),(BB$81-ROUNDDOWN(BB$81,0))+N(\"Primary\"),\nIF(AND(ROUNDDOWN(BB$84,0)=$BA89,BB$85>0),(BB$84-ROUNDDOWN(BB$84,0))+N(\"Secondary\"),\nIF(AND(ROUNDDOWN(BB$87,0)=$BA89,BB$88>0),(BB$87-ROUNDDOWN(BB$87,0))+N(\"Tertiary\"),\n0)))))))))))))","v":0},{"$f":"IF($AW$19=TRUE,1,\nIF(AND(BC$80<=$BA89,(BC$80+BC$82)>=($BA89+1)),1+N(\"Primary\"),\nIF(AND(BB$80>$BA89,(BB$80+BB$82)>=($BA89+1+24)),1+N(\"Primary\"),\nIF(AND(BC$83<=$BA89,(BC$83+BC$85)>=($BA89+1)),1+N(\"Secondary\"),\nIF(AND(BB$83>$BA89,(BB$83+BB$85)>=($BA89+1+24)),1+N(\"Secondary\"),\nIF(AND(BC$86<=$BA89,(BC$86+BC$88)>=($BA89+1)),1+N(\"Tertiary\"),\nIF(AND(BB$86>$BA89,(BB$86+BB$88)>=($BA89+1+24)),1+N(\"Tertiary\"),\nIF(AND(ROUNDDOWN(BC$80,0)=$BA89,BC$82>0),1-(BC$80-ROUNDDOWN(BC$80,0))+IF(ROUNDDOWN(BB$81,0)-24=$BA89,(BB$81-ROUNDDOWN(BB$81,0)),0)+N(\"Primary\"),\nIF(AND(ROUNDDOWN(BC$83,0)=$BA89,BC$85>0),1-(BC$83-ROUNDDOWN(BC$83,0))+IF(ROUNDDOWN(BB$84,0)-24=$BA89,(BB$84-ROUNDDOWN(BB$84,0)),0)+N(\"Secondary\"),\nIF(AND(ROUNDDOWN(BC$86,0)=$BA89,BC$88>0),1-(BC$86-ROUNDDOWN(BC$86,0))+IF(ROUNDDOWN(BB$87,0)-24=$BA89,(BB$87-ROUNDDOWN(BB$87,0)),0)+N(\"Tertiary\"),\nIF(AND(ROUNDDOWN(BC$81,0)=$BA89,BC$82>0),(BC$81-ROUNDDOWN(BC$81,0))+N(\"Primary\"),\nIF(AND(ROUNDDOWN(BC$84,0)=$BA89,BC$85>0),(BC$84-ROUNDDOWN(BC$84,0))+N(\"Secondary\"),\nIF(AND(ROUNDDOWN(BC$87,0)=$BA89,BC$88>0),(BC$87-ROUNDDOWN(BC$87,0))+N(\"Tertiary\"),\n0)))))))))))))","v":0},0,0,0,0,0]
[null,null,null,null,null,null,"Church / School",null,null,null,null,null,null,null,null,"University",null,null,null,null,null,null,null,null,null,"Customer Role",null,null,null,null,null,null,null,null,null,null,null,null,null,null,"Index",null,null,null,null,null,null,null,null,null,null,null,1,0,0,0,0,0,0,0]
[null,null,null,null,null,null,"Clinic",null,null,null,null,null,null,null,null,"Other",null,null,null,null,null,null,null,null,null,"Owner",null,null,null,null,null,null,null,null,null,null,null,null,null,null,"Lake Stevens",null,null,null,null,null,null,null,null,null,null,null,2,0,0,0,0,0,0,0]
[null,null,null,null,null,null,"Communication",null,null,null,null,null,null,null,null,null,null,null,null,null,null,null,null,null,null,"Facility Manager",null,null,null,null,null,null,null,null,null,null,null,null,null,null,"Lynnwood",null,null,null,null,null,null,null,null,null,null,null,3,0,0,0,0,0,0,0]
[null,null,null,null,null,null,"Conference Center",null,null,null,null,null,null,null,null,null,null,null,null,null,null,null,null,null,null,"Property Manager",null,null,null,null,null,null,null,null,null,null,null,null,null,null,"Marysville",null,null,null,null,null,null,null,null,null,null,null,4,0,0,0,0,0,0,0]
[null,null,null,null,null,null,"Data Center",null,null,null,null,null,null,null,null,null,null,null,null,null,null,null,null,null,null,"Tenant",null,null,null,null,null,null,null,null,null,null,null,null,null,null,"Mill Creek",null,null,null,null,null,null,null,null,null,null,null,5,0,0,0,0,0,0,0]
[null,null,null,null,null,null,"Daycare",null,null,null,null,null,null,null,null,null,null,null,null,null,null,null,null,null,null,"Customer Rep",null,null,null,null,null,null,null,null,null,null,null,null,null,null,"Monroe",null,null,null,null,null,null,null,null,null,null,null,6,0,0,0,0,0,0,0]
[null,null,null,null,null,null,"District Facility",null,null,null,null,null,null,null,null,null,null,null,null,null,null,null,null,null,null,null,null,null,null,null,null,null,null,null,null,null,null,null,null,null,"Mountlake Terrace",null,null,null,null,null,null,null,null,null,null,null,7,0,0,0,0,0,0,0]
[null,null,null,null,null,null,"Federal Government",null,null,null,null,null,null,null,null,"Commercial","Industrial",null,null,null,null,null,null,null,null,null,null,null,null,null,null,"Spec Sheets",false,null,null,null,null,null,null,null,"Mukilteo",null,null,null,null,null,null,null,null,null,null,null,8,0,1,1,1,1,1,0]
[null,null,null,null,null,null,"FPD",null,null,null,null,null,null,null,null,"Large Office >50K SQ FT","Transportation, Equipment",null,null,null,null,null,null,null,null,null,null,null,null,null,null,"Project Bid",false,null,null,null,null,null,null,null,"Silvana",null,null,null,null,null,null,null,null,null,null,null,9,0,1,1,1,1,1,0]
[null,null,null,null,null,null,"Hospital",null,null,null,null,null,null,null,null,"Medium Office 5K-50K SQ FT","Metal Fabrication",null,null,null,null,null,null,null,null,null,null,null,null,null,null,"Customer W9",false,null,null,null,null,null,null,null,"Snohomish",null,null,null,null,null,null,null,null,null,null,null,10,0,{"$f":"IF($AW$19=TRUE,1,\nIF(AND(BC$80<=$BA99,(BC$80+BC$82)>=($BA99+1)),1+N(\"Primary\"),\nIF(AND(BB$80>$BA99,(BB$80+BB$82)>=($BA99+1+24)),1+N(\"Primary\"),\nIF(AND(BC$83<=$BA99,(BC$83+BC$85)>=($BA99+1)),1+N(\"Secondary\"),\nIF(AND(BB$83>$BA99,(BB$83+BB$85)>=($BA99+1+24)),1+N(\"Secondary\"),\nIF(AND(BC$86<=$BA99,(BC$86+BC$88)>=($BA99+1)),1+N(\"Tertiary\"),\nIF(AND(BB$86>$BA99,(BB$86+BB$88)>=($BA99+1+24)),1+N(\"Tertiary\"),\nIF(AND(ROUNDDOWN(BC$80,0)=$BA99,BC$82>0),1-(BC$80-ROUNDDOWN(BC$80,0))+IF(ROUNDDOWN(BB$81,0)-24=$BA99,(BB$81-ROUNDDOWN(BB$81,0)),0)+N(\"Primary\"),\nIF(AND(ROUNDDOWN(BC$83,0)=$BA99,BC$85>0),1-(BC$83-ROUNDDOWN(BC$83,0))+IF(ROUNDDOWN(BB$84,0)-24=$BA99,(BB$84-ROUNDDOWN(BB$84,0)),0)+N(\"Secondary\"),\nIF(AND(ROUNDDOWN(BC$86,0)=$BA99,BC$88>0),1-(BC$86-ROUNDDOWN(BC$86,0))+IF(ROUNDDOWN(BB$87,0)-24=$BA99,(BB$87-ROUNDDOWN(BB$87,0)),0)+N(\"Tertiary\"),\nIF(AND(ROUNDDOWN(BC$81,0)=$BA99,BC$82>0),(BC$81-ROUNDDOWN(BC$81,0))+N(\"Primary\"),\nIF(AND(ROUNDDOWN(BC$84,0)=$BA99,BC$85>0),(BC$84-ROUNDDOWN(BC$84,0))+N(\"Secondary\"),\nIF(AND(ROUNDDOWN(BC$87,0)=$BA99,BC$88>0),(BC$87-ROUNDDOWN(BC$87,0))+N(\"Tertiary\"),\n0)))))))))))))","v":1},1,1,1,1,0]
[null,null,null,null,null,null,"Hotel / Motel",null,null,null,null,null,null,null,null,"Small Office <5K SQ FT","Misc Manufacturing",null,null,null,null,null,null,null,null,null,null,null,null,null,null,"Contractor W9",false,null,null,null,null,null,null,null,"Stanwood",null,null,null,null,null,null,null,null,null,null,null,11,0,1,1,1,1,1,0]
[null,null,null,null,null,null,"Industrial & Manufacturing",null,null,null,null,null,null,null,null,"Extra Large Retail  >100K SQ FT","Foundries",null,null,null,null,null,null,null,null,null,null,null,null,null,null,null,null,null,null,null,null,null,null,null,"Sultan",null,null,null,null,null,null,null,null,null,null,null,12,0,1,1,1,1,1,0]
[null,null,null,null,null,null,"Library",null,null,null,null,null,null,null,null,"Large Retail >50K - 100K SQ FT","Indoor Agriculture",null,null,null,null,null,null,null,null,null,null,null,null,null,null,null,null,null,null,null,null,null,null,null,"Woodinville",null,null,null,null,null,null,null,null,null,null,null,13,0,1,1,1,1,1,0]
[null,null,null,null,null,null,"Local Government",null,null,null,null,null,null,null,null,"Medium Retail 5K - 50K SQ FT","Refinery",null,null,null,null,null,null,null,null,null,null,null,null,null,null,null,null,null,null,null,null,null,null,null,"Woodway",null,null,null,null,null,null,null,null,null,null,null,14,0,1,1,1,1,1,0]
[null,null,null,null,null,null,"Medical & Dental",null,null,null,null,null,null,null,null,"Small Retail <5K","Water and Wastewater",null,null,null,null,null,null,null,null,null,null,null,null,null,null,null,null,null,null,null,null,null,null,null,null,null,null,null,null,null,null,null,null,null,null,null,15,0,1,1,1,1,1,0]
[null,null,null,null,null,null,"Non-profit",null,null,null,null,null,null,null,null,"K-12","Data Center",null,null,null,null,null,null,null,null,null,null,null,null,null,null,null,null,null,null,null,null,null,null,null,null,null,null,null,null,null,null,null,null,null,null,null,16,0,1,1,1,1,1,0]
[null,null,null,null,null,null,"Nursing & Retirement Homes",null,null,null,null,null,null,null,null,"University","Data Closet",null,null,null,null,null,null,null,null,null,null,null,null,null,null,null,null,null,null,null,null,null,null,null,null,null,null,null,null,null,null,null,null,null,null,null,17,0,1,1,1,1,1,0]
[null,null,null,null,null,null,"Office Building",null,null,null,null,null,null,null,null,"Warehouse","Cold Storage",null,null,null,null,null,null,null,null,null,null,null,null,null,null,null,null,null,null,null,null,null,null,null,null,null,null,null,null,null,null,null,null,null,null,null,18,0,0,0,0,0,0,0]
[null,null,null,null,null,null,"Other - Commercial",null,null,null,null,null,null,null,null,"Supermarket => 5K SQ FT","Chemical",null,null,null,null,null,null,null,null,null,null,null,null,null,null,null,null,null,null,null,null,null,null,null,null,null,null,null,null,null,null,null,null,null,null,null,19,0,0,0,0,0,0,0]
[null,null,null,null,null,null,"Other - Industrial",null,null,null,null,null,null,null,null,"MiniMart < 5K SQ FT","Wood - Lumber",null,null,null,null,null,null,null,null,null,null,null,null,null,null,null,null,null,null,null,null,null,null,null,null,null,null,null,null,null,null,null,null,null,null,null,20,0,{"$f":"IF($AW$19=TRUE,1,\nIF(AND(BC$80<=$BA109,(BC$80+BC$82)>=($BA109+1)),1+N(\"Primary\"),\nIF(AND(BB$80>$BA109,(BB$80+BB$82)>=($BA109+1+24)),1+N(\"Primary\"),\nIF(AND(BC$83<=$BA109,(BC$83+BC$85)>=($BA109+1)),1+N(\"Secondary\"),\nIF(AND(BB$83>$BA109,(BB$83+BB$85)>=($BA109+1+24)),1+N(\"Secondary\"),\nIF(AND(BC$86<=$BA109,(BC$86+BC$88)>=($BA109+1)),1+N(\"Tertiary\"),\nIF(AND(BB$86>$BA109,(BB$86+BB$88)>=($BA109+1+24)),1+N(\"Tertiary\"),\nIF(AND(ROUNDDOWN(BC$80,0)=$BA109,BC$82>0),1-(BC$80-ROUNDDOWN(BC$80,0))+IF(ROUNDDOWN(BB$81,0)-24=$BA109,(BB$81-ROUNDDOWN(BB$81,0)),0)+N(\"Primary\"),\nIF(AND(ROUNDDOWN(BC$83,0)=$BA109,BC$85>0),1-(BC$83-ROUNDDOWN(BC$83,0))+IF(ROUNDDOWN(BB$84,0)-24=$BA109,(BB$84-ROUNDDOWN(BB$84,0)),0)+N(\"Secondary\"),\nIF(AND(ROUNDDOWN(BC$86,0)=$BA109,BC$88>0),1-(BC$86-ROUNDDOWN(BC$86,0))+IF(ROUNDDOWN(BB$87,0)-24=$BA109,(BB$87-ROUNDDOWN(BB$87,0)),0)+N(\"Tertiary\"),\nIF(AND(ROUNDDOWN(BC$81,0)=$BA109,BC$82>0),(BC$81-ROUNDDOWN(BC$81,0))+N(\"Primary\"),\nIF(AND(ROUNDDOWN(BC$84,0)=$BA109,BC$85>0),(BC$84-ROUNDDOWN(BC$84,0))+N(\"Secondary\"),\nIF(AND(ROUNDDOWN(BC$87,0)=$BA109,BC$88>0),(BC$87-ROUNDDOWN(BC$87,0))+N(\"Tertiary\"),\n0)))))))))))))","v":0},0,0,0,0,0]
[null,null,null,null,null,null,"Parking Garage",null,null,null,null,null,null,null,null,"Restaurant","Wood - Panel",null,null,null,null,null,null,null,null,null,null,null,null,null,null,null,null,null,null,null,null,null,null,null,null,null,null,null,null,null,null,null,null,null,null,null,21,0,0,0,0,0,0,0]
[null,null,null,null,null,null,"Recreational",null,null,null,null,null,null,null,null,"Multifamily","Wood - Other",null,null,null,null,null,null,null,null,null,null,null,null,null,null,null,null,null,null,null,null,null,null,null,null,null,null,null,null,null,null,null,null,null,null,null,22,0,0,0,0,0,0,0]
[null,null,null,null,null,null,"Research Lab",null,null,null,null,null,null,null,null,"Lodging","Paper",null,null,null,null,null,null,null,null,null,null,null,null,null,null,null,null,null,null,null,null,null,null,null,null,null,null,null,null,null,null,null,null,null,null,null,23,0,0,0,0,0,0,0]
[null,null,null,null,null,null,"Restaurant & Tavern",null,null,null,null,null,null,null,null,"Hospital","Other"]
[null,null,null,null,null,null,"Retail Trade & Services",null,null,null,null,null,null,null,null,"Outpatient Care"]
[null,null,null,null,null,null,"School",null,null,null,null,null,null,null,null,"Residential Care"]
[null,null,null,null,null,null,"Senior Center",null,null,null,null,null,null,null,null,"Assembly"]
[null,null,null,null,null,null,"Storage",null,null,null,null,null,null,null,null,"Other"]
[null,null,null,null,null,null,"Transportation"]
[null,null,null,null,null,null,"Warehouse"]
[null,null,null,null,null,null,"Water / Wastewater"]
[null,null,null,null,null,null,"Wholesale & Retail Food"]
[null,null,null,null,null,null,"Other"]

{"sheet":"Tracking Sheet","index":2,"n_rows":38,"n_cols":48,"rows_kept":38,"cut":false,"hidden":true,"merged":[[12,14,12,17],[12,18,12,19],[12,20,12,22],[12,35,12,38],[13,39,13,40],[13,41,13,43],[16,2,16,43],[12,39,12,40],[12,41,12,43],[11,16,11,22],[11,23,11,31],[11,32,11,36],[11,37,11,43],[9,2,9,10],[9,11,9,15],[9,16,9,22],[9,23,9,31],[9,32,9,36],[9,37,9,43],[11,2,11,10],[11,11,11,15],[2,2,2,43],[3,12,3,33],[5,2,5,43],[6,19,6,22],[6,40,6,43],[7,2,7,15],[7,16,7,18],[7,19,7,22],[7,23,7,39],[7,40,7,43],[18,2,18,15],[18,16,18,21],[18,22,18,27],[17,31,17,33],[17,34,17,36],[17,37,17,39],[17,40,17,43],[13,2,13,13],[13,14,13,17],[13,18,13,19],[13,20,13,22],[13,23,13,34],[13,35,13,38],[18,37,18,39],[18,40,18,43],[17,28,17,30],[21,14,21,17],[21,18,21,20],[21,21,21,22],[21,23,21,43],[19,2,19,5],[19,6,19,9],[19,10,19,13],[19,14,19,17],[19,18,19,20],[19,21,19,22],[19,23,19,25],[30,23,30,25],[35,17,35,19],[36,17,36,19],[36,2,36,16],[18,28,18,30],[18,31,18,33],[18,34,18,36],[20,23,20,43],[23,2,23,5],[23,6,23,9],[23,10,23,13],[23,14,23,17],[23,18,23,20],[23,21,23,22],[23,23,23,43],[20,2,20,5],[20,6,20,9],[20,10,20,13],[20,14,20,17],[20,18,20,20],[20,21,20,22],[21,2,21,5],[21,6,21,9],[21,10,21,13],[36,38,36,40],[35,35,35,37],[35,38,35,40],[34,35,34,37],[36,26,36,28],[36,29,36,31],[28,41,28,43],[34,2,34,4],[34,5,34,7],[34,8,34,10],[34,11,34,13],[34,14,34,16],[34,26,34,28],[34,20,34,22],[34,32,34,34],[28,18,28,22],[36,23,36,25],[35,23,35,25],[35,20,35,22],[36,20,36,22],[30,2,30,4],[30,5,30,7],[30,8,30,10],[30,14,30,16],[34,17,34,19],[36,41,36,43],[27,26,27,28],[31,23,31,25],[33,23,33,25],[34,23,34,25],[35,41,35,43],[33,20,33,22],[35,26,35,28],[35,29,35,31],[35,32,35,34],[30,32,30,34],[30,35,30,37],[30,38,30,40],[31,41,31,43],[30,41,30,43],[27,23,27,25],[27,29,27,31],[34,38,34,40],[34,41,34,43],[34,29,34,31],[36,32,36,34],[36,35,36,37],[33,26,33,28],[27,38,27,40],[27,41,27,43],[27,32,27,37],[33,17,33,19],[33,2,33,4],[33,5,33,7],[33,8,33,10],[33,11,33,13],[33,14,33,16],[28,23,28,25],[28,29,28,31],[31,2,31,4],[31,5,31,7],[31,8,31,10],[31,14,31,16],[31,26,31,28],[31,20,31,22],[30,26,30,28],[30,20,30,22],[33,32,33,34],[33,35,33,37],[33,38,33,40],[33,41,33,43],[33,29,33,31],[22,2,22,5],[22,6,22,9],[22,10,22,13],[22,14,22,17],[22,18,22,20],[24,2,25,5],[31,17,31,19],[31,32,31,34],[31,35,31,37],[30,29,30,31],[28,2,28,7],[28,8,28,17],[28,26,28,28],[31,11,31,13],[30,11,30,13],[30,17,30,19],[31,29,31,31],[22,21,22,22],[22,23,22,43],[31,38,31,40],[28,38,28,40],[28,32,28,37],[27,2,27,7],[26,2,26,43]]}
[]
[null,null,1,2,3,4,5,6,7,8,9,10,11,12,13,14,15,16,17,18,19,20,21,22,23,24,25,26,27,28,29,30,31,32,33,34,35,36,37,38,39,40,41,42]
[null,null,{"$f":"BannerText","v":"Energy Services  ●  eebiz@snopud.com  ●  www.snopud.com"}]
[null,null,null,null,null,null,null,null,null,null,null,null,"Energy Efficiency Project Tracking Sheet"]
[null,null,"CUSTOMER INFO",null,null,null,null,null,null,null,null,null,null,null,null,null,null,null,null,null,null,null,null,"CONTRACTOR INFO"]
[]
[null,null,"Business Name (from W-9):",null,null,null,null,null,null,null,null,null,null,null,null,null," Mng'd Acct?",null,null," Vendor #",null,null,null,"Business Name (from W-9):",null,null,null,null,null,null,null,null,null,null,null,null,null,null,null,null," Vendor #"]
[null,null,{"$f":"App_CustName","v":0},null,null,null,null,null,null,null,null,null,null,null,null,null,2,null,null,null,null,null,null,{"$f":"IF(SelfInstall,\"Self-Install\",TAcompany)","v":0},null,null,null,null,null,null,null,null,null,null,null,null,null,null,null,null,null,null,null,null,null,null,null,0]
[null,null,"Primary Contact",null,null,null,null,null,null,null,null,"Phone",null,null,null,null,"Email",null,null,null,null,null,null,"Primary Contact",null,null,null,null,null,null,null,null,"Phone",null,null,null,null,"Email"]
[null,null,{"$f":"App_CustPriName","v":0},null,null,null,null,null,null,null,null,{"$f":"App_CustPriPhone","v":0},null,null,null,null,{"$f":"App_CustPriEmail","v":0},null,null,null,null,null,null,{"$f":"IF(SelfInstall,\"\",TAcontact)","v":0},null,null,null,null,null,null,null,null,{"$f":"IF(SelfInstall,\"\",TAphone)","v":0},null,null,null,null,{"$f":"IF(SelfInstall,\"\",TAemail)","v":0}]
[null,null," Secondary Contact",null,null,null,null,null,null,null,null," Phone",null,null,null,null," Email",null,null,null,null,null,null," Secondary Contact",null,null,null,null,null,null,null,null," Phone",null,null,null,null," Email"]
[]
[null,null,"Mailing Address",null,null,null,null,null,null,null,null,null,null,null,"City",null,null,null,"State",null,"Zip",null,null,"Mailing Address",null,null,null,null,null,null,null,null,null,null,null,"City",null,null,null,"State",null,"Zip"]
[null,null,{"$f":"IF(App_SameAddressFlag,App_FacAdd,App_CustAdd)","v":0},null,null,null,null,null,null,null,null,null,null,null,{"$f":"IF(App_SameAddressFlag,App_FacCity,App_CustCity)","v":0},null,null,null,{"$f":"IF(App_SameAddressFlag,\"WA\",App_CustState)","v":0},null,{"$f":"IF(App_SameAddressFlag,App_FacZip,App_CustZip)","v":0},null,null,{"$f":"IF(SelfInstall,\"\",TAaddress)","v":0},null,null,null,null,null,null,null,null,null,null,null,{"$f":"IF(SelfInstall,\"\",TAcity)","v":0},null,null,null,{"$f":"IF(SelfInstall,\"\",TAstate)","v":0},null,{"$f":"IF(SelfInstall,\"\",TAzip)","v":0}]
[]
[null,null,{"$f":"IF(App_FacName=\"\",\"Facility Info\",App_FacName)","v":"Facility Info"}]
[]
[null,null," Facility Address:",null,null,null,null,null,null,null,null,null,null,null,null,null,"Commercial/Industrial?",null,null,null,null,null,"Premise Type",null,null,null,null,null," Multi-Tenant",null,null,"Sq Footage",null,null," Cooling",null,null," Heating Type",null,null,"Total Facility kWh"]
[null,null,{"$f":"IF(App_FacAdd=\"\",\"\",App_FacAdd&\" \"&App_FacCity&\", WA \"&FacZip)","v":""},null,null,null,null,null,null,null,null,null,null,null,null,null,{"$f":"IF(App_PremCategory=\"\",\"[Select Facility Type]\",IF(App_PremCategory=1,\"Commercial\",\"Industrial\"))","v":"Commercial"},null,null,null,null,null,{"$f":"App_PremType","v":"[Select Premise Type]"},null,null,null,null,null,{"$f":"App_MultiTen","v":0},null,null,{"$f":"App_SqFt","v":0},null,null,{"$f":"App_AC","v":0},null,null,{"$f":"App_HeatSource","v":0},null,null,{"$f":"SUM(S21:U24)","v":0}]
[null,null,"Account #",null,null,null,"Meter #",null,null,null,"Premise",null,null,null,"Installation",null,null,null,"Annual kWh",null,null,"Peak KW",null," Notes"]
[]
[]
[]
[]
[null,null,"Project Info"]
[]
[]
[null,null,"Program Name",null,null,null,null,null,"Project Name",null,null,null,null,null,null,null,null,{"$f":"40-LEN(I29)&\" Characters Remaining\"","v":"40 Characters Remaining"}," Assigned Staff",null,null,null,null,"Assigned Date",null,null," Commit. Date",null,null,"Exp. Pay Date",null,null,"Active Promo Code",null,null,null,null,null,"Promo Exp.",null,null,"SharePoint ID"]
[null,null,"Lighting Efficiency"]
[null,null,"Authorization"]
[null,null,"Authorization Approved By",null,null,"Authorization\nDate",null,null,"Authorization Expiration",null,null,"Project \nExpiration",null,null,"Project \nCost",null,null,"Base \nIncentive",null,null,"Bonus \nIncentive",null,null,"Admin \nIncentive",null,null,"Total \nIncentive",null,null,"Cust. kWh/yr Savings",null,null,"Incen. kWh/yr Savings",null,null,"Non-Incen. Savings",null,null,"kW \nReduction",null,null,"Peak kW Reduction"]
[null,null,null,null,null,null,null,null,null,null,null,null,null,null,{"$f":"TotalCost","v":0},null,null,{"$f":"BaseIncentive","v":0},null,null,{"$f":"_xlfn.SINGLE(BonusIncentive)","v":0},null,null,{"$f":"IF(BaseIncentive=0,0,ProjDevIncentive)","v":0},null,null,{"$f":"IFERROR(SUM(AuthBaseIncentive,AuthBonusIncentive,AuthAdminIncentive),0)","v":0},null,null,{"$f":"TotalSavings","v":0},null,null,{"$f":"IncentedkWh","v":0},null,null,{"$f":"NonIncentedkWh","v":0},null,null,{"$f":"kWReduction","v":0},null,null,{"$f":"kWReductionPeak","v":0}]
[null,null,"Project Completion"]
[null,null,"Inspection\nDate",null,null,"Payment App. Req. Date",null,null,"Payment \nApproved By",null,null,"Payment Approval Date",null,null,"Project \nCost",null,null,"Base \nIncentive",null,null,"Bonus \nIncentive",null,null,"Admin \nIncentive",null,null,"Total \nIncentive",null,null,"Cust. kWh/yr Savings",null,null,"Incen. kWh/yr Savings",null,null,"Non-Incen. Savings",null,null,"kW \nReduction",null,null,"Peak kW Reduction"]
[null,null,{"$f":"VerificationDate","v":"00:00:00"},null,null,null,null,null,null,null,null,null,null,null,{"$f":"IF(VerificationDate=\"\",\"\",TotalCost)","v":""},null,null,{"$f":"IF(VerificationDate=\"\",\"\",BaseIncentive)","v":""},null,null,{"$f":"IF(VerificationDate=\"\",\"\",BonusIncentive)","v":""},null,null,{"$f":"IF(VerificationDate=\"\",0,ProjDevIncentive)","v":0},null,null,{"$f":"IFERROR(SUM(FinalBaseIncentive,FinalBonusIncentive,FinalAdminIncentive),0)","v":0},null,null,{"$f":"IF(VerificationDate=\"\",\"\",TotalSavings)","v":""},null,null,{"$f":"IF(VerificationDate=\"\",\"\",IncentedkWh)","v":""},null,null,{"$f":"IF(VerificationDate=\"\",\"\",NonIncentedkWh)","v":""},null,null,{"$f":"IF(VerificationDate=\"\",\"\",kWReduction)","v":""},null,null,{"$f":"IF(VerificationDate=\"\",\"\",kWReductionPeak)","v":""}]
[null,null,"Notes",null,null,null,null,null,null,null,null,null,null,null,null,null,"Additional Info->:","Active Incentive Rate",null,null,"Project Cost/kWh",null,null,"Baseline Adjusted?",null,null,"Baseline as % of total kWh",null,null," kWh/yr Reduction %",null,null,"Cust. $/yr Savings",null,null,"Incentive As % of Cost",null,null,{"$f":"\"Cust. Net $ (\"&CostType&\")\"","v":"Cust. Net $ (Material)"},null,null,"Cancel\nDate"]
[null,null,null,null,null,null,null,null,null,null,null,null,null,null,null,null,null,2025,null,null,{"$f":"CostPerKWH","v":""},null,null,null,null,null,{"$f":"ExistingPercentofTotalUse","v":""},null,null,{"$f":"PercentkWhSavings","v":""},null,null,{"$f":"EstAnnualCostSavings","v":0},null,null,{"$f":"IFERROR(IncentiveAmount/TotalCost,\"\")","v":""},null,null,{"$f":"CustNetCost","v":0}]
[null,null,null,null,null,null,null,null,null,null,null,null,null,null,null,null,null,null,null,null,null,null,null,null,null,null,null,null,null,null,null,null,null,null,null,null,null,null,null,null,null,null,null,{"$f":"Version","v":"Version April 2025 - Effective Date April 1st, 2025"}]

{"sheet":"Participation Agreement","index":3,"n_rows":53,"n_cols":31,"rows_kept":53,"cut":false,"hidden":true,"merged":[[34,4,34,11],[12,9,13,11],[23,2,23,26],[14,16,15,18],[14,19,15,21],[14,9,15,11],[12,19,13,21],[12,16,13,18],[16,3,18,21],[2,2,2,26],[4,23,4,25],[6,20,6,25],[11,17,11,26],[11,12,11,16],[11,2,11,11],[8,12,9,16],[4,2,5,12],[6,2,6,15],[48,3,48,25],[5,23,5,25],[12,22,12,25],[14,3,15,8],[19,17,19,19],[14,12,15,13],[20,2,20,26],[21,21,21,25],[42,14,42,18],[42,19,42,26],[42,5,42,11],[42,12,42,13],[13,12,13,13],[13,14,13,15],[14,14,15,15],[34,12,34,25]]}
[]
[]
[null,null,{"$f":"BannerText","v":"Energy Services  ●  eebiz@snopud.com  ●  www.snopud.com"}]
[]
[null,null,"Participation Agreement",null,null,null,null,null,null,null,null,null,null,null,null,null,null,null,null,null,null,null,"Promo Code:",{"$f":"PromoInputValue","v":0},null,null,null,null,null,"Important Dates "]
[null,null,null,null,null,null,null,null,null,null,null,null,null,null,null,null,null,null,null,null,null,null,"PUD Staff:",{"$f":"AssignedStaff","v":0},null,null,null,null,null,{"$f":"AuthExpDate","v":"00:00:00"},"= Complete/Sign This Form By:"]
[null,null,"For Energy Efficiency Projects in Commercial & Industrial Facilities",null,null,null,null,null,null,null,null,null,null,null,null,null,null,null,null,"Project Name:",{"$f":"ProjectName","v":0},null,null,null,null,null,null,null,null,{"$f":"ProjExpDate","v":"00:00:00"},"= Agreement Expires On:"]
[]
[null,null,null,null,null,null,null,null,null,null,null,null,{"$f":"IF(AsBuiltFlag=\"As-Built\",\"  AS-BUILT  \",\"\")","v":""}]
[null,null,"Facility & Project Information"]
[null,null," Customer's Business Name",null,null,null,null,null,null,null,null,null," Facility Name",null,null,null,null," Facility Address"]
[null,null,{"$f":"CustW9Name","v":0},null,null,null,null,null,null,null,null,null,{"$f":"App_FacName","v":0},null,null,null,null,{"$f":"FacAddressFull","v":""}]
[null,null,null,null,null,null,null,null,null,"Estimated Annual\nEnergy Savings",null,null,null,null,null,null,"Energy Savings Incentive",null,null,"Project Development Incentive2"]
[null,null,null,"Energy Efficiency Project(s)",null,null,null,null,null,null,null,null,"Project Cost",null,"Cost Type"]
[null,null,null,"Lighting Retrofit Project1",null,null,null,null,null,{"$f":"IFERROR(TotalSavings,0)","v":0},null,null,{"$f":"TotalCost","v":0},null,{"$f":"CostType","v":"Material"},null,{"$f":"IF(OR(TotalCost=0,TotalCost=\"\"),0,IncentiveAmount)","v":0},null,null,{"$f":"ProjDevIncentive","v":50}]
[]
[null,null,null,{"$f":"\"1.) Please see attached Worksheets for Details\n2.) \"& \"The Project Development Incentive is paid to the company primarily responsible for filling out this workbook, assembling the required documents and submitting the complete application packet. The Project Development Incentive shall be paid to: \" & IF(AND(NOT(PDItoCust),LEN(ContractorW9Name)>1),ContractorW9Name,CustW9Name)","v":"1.) Please see attached Worksheets for Details\n2.) The Project Development Incentive is paid to the company primarily responsible for filling out this workbook, assembling the required documents and submitting the complete application packet. The Project Development Incentive shall be paid to: 0"}]
[]
[]
[null,null,"Project Verification"]
[]
[]
[null,null,"Terms & Conditions"]
[]
[]
[]
[]
[]
[]
[]
[]
[null,null,"Project Payment (Please select one option below.)"]
[]
[null,null,null,null,"Customer Receives PUD Energy Incentive Payment (Rebates)",null,null,null,null,null,null,null,null,null,null,null,null,null,null,null,null,null,null,null,null,null,null,null,null,"Customer Payment Flag"]
[null,null,null,null,"Customer Assigns PUD Energy Incentive Payment (Rebates) to:",null,null,null,null,null,null,null,{"$f":"TAcompany","v":0},null,null,null,null,null,null,null,null,null,null,null,null,null,null,null,null,1]
[]
[]
[]
[]
[]
[null,null,"By signing below, I certify that I have read, understand, and agree to the terms and conditions above."]
[]
[]
[null,null,null,null,null,"Authorized Signature",null,null,null,null,null,null," Date",null," Print Name",null,null,null,null,"Title"]
[]
[null,null,null,null,null,null,null,null,null,null,null,null,null,null,null,null,null,null,null,null,null,null,null,null,null,null,{"$f":"Version","v":"Version April 2025 - Effective Date April 1st, 2025"}]
[]
[]
[null,null,null,"Drop Down List"]
[null,null,null,"VerificationType",null,null,"SheetsToPrint"]
[null,null,null,"(Please select Verification Type)\n",null,null,"Lighting Input Form","."]
[null,null,null,"Snohomish PUD will verify the scope of this project has been installed as Authorized.  On-site progress and/or post installation verification may be required.",null,null,"Lighting Retrofit Summary","."]
[null,null,null,"Customer certifies the scope of this project has been completed, specified products have been installed, and the invoiced amount matches your records.",null,null,"Lighting Retrofit Worksheet","."]

{"sheet":"Lighting Input Form","index":4,"n_rows":39,"n_cols":37,"rows_kept":39,"cut":false,"hidden":false,"merged":[[18,31,19,31],[18,32,19,32],[18,33,19,33],[18,34,19,34],[18,35,19,35],[18,36,19,36],[19,11,19,13],[19,19,19,21],[18,3,19,3],[18,4,19,5],[18,6,19,6],[18,7,19,7],[18,11,18,13],[18,19,18,21],[18,22,19,22],[18,24,19,24],[18,25,19,26],[22,34,23,34],[22,35,23,35],[22,36,23,36],[23,11,23,13],[23,19,23,21],[22,3,23,3],[22,4,23,5],[22,6,23,6],[22,7,23,7],[22,11,22,13],[22,19,22,21],[22,22,23,22],[22,24,23,24],[22,25,23,26],[20,3,21,3],[20,4,21,5],[20,6,21,6],[20,7,21,7],[20,11,20,13],[20,19,20,21],[20,22,21,22],[20,24,21,24],[20,25,21,26],[21,11,21,13],[21,19,21,21],[20,31,21,31],[20,32,21,32],[20,33,21,33],[4,15,5,19],[6,15,6,19],[24,36,25,36],[24,24,25,24],[24,25,25,26],[20,36,21,36],[24,35,25,35],[16,36,17,36],[16,35,17,35],[16,34,17,34],[16,33,17,33],[16,32,17,32],[16,31,17,31],[15,19,15,21],[16,22,17,22],[16,24,17,24],[20,34,21,34],[20,35,21,35],[22,31,23,31],[22,32,23,32],[22,33,23,33],[2,2,2,27],[11,24,11,27],[5,24,5,26],[7,24,7,26],[6,24,6,26],[14,3,14,26],[16,3,17,3],[16,11,16,13],[16,4,17,5],[16,25,17,26],[16,6,17,6],[16,7,17,7],[17,11,17,13],[4,2,5,11],[6,2,7,14],[15,11,15,13],[11,2,11,12],[16,19,16,21],[17,19,17,21],[15,25,15,26],[15,4,15,5],[33,18,33,19],[32,18,32,19],[28,25,28,26],[24,4,25,5],[24,6,25,6],[24,19,24,21],[24,11,24,13],[25,11,25,13],[37,2,38,20],[36,2,36,20],[31,2,31,27],[30,2,30,27],[32,3,32,6],[33,3,33,6],[33,10,33,12],[33,14,33,15],[33,16,33,17],[33,21,33,26],[33,7,33,9],[32,7,32,9],[32,10,32,12],[32,14,32,15],[32,16,32,17],[32,21,32,26],[27,25,27,26],[28,20,28,21],[24,3,25,3],[24,22,25,22],[24,7,25,7],[25,19,25,21],[26,25,26,26],[24,32,25,32],[24,34,25,34],[24,33,25,33],[24,31,25,31]]}
[]
[]
[null,null,{"$f":"BannerText","v":"Energy Services  ●  eebiz@snopud.com  ●  www.snopud.com"}]
[]
[null,null,"Lighting Input Form",null,null,null,null,null,null,null,null,null,null,null,null,{"$f":"IFERROR(IF(AND(AsBuiltFlag=\"AS-BUILT\",AuthDate<>\"\"),\"AS-BUILT\",\nIF(AND(IncentiveAmount>25000,OR(AuthDate=\"\",AuthDate=0)),\"! Large Rebate Alert !\",\"\")),\"\")","v":""}]
[null,null,null,null,null,null,null,null,null,null,null,null,null,null,null,null,null,null,null,null,null,null,null,"PUD Staff:",{"$f":"AssignedStaff","v":0}]
[null,null,"For Energy Efficiency Projects in Commercial & Industrial Facilities.",null,null,null,null,null,null,null,null,null,null,null,null,{"$f":"IFERROR(IF(P5=\"! Large Rebate Alert !\",\nIF(MaxRebate>=RebateCap,\"Max Rebate \"&TEXT(RebateCap,\"$0,0\"),\n\"Contact PUD to Ensure Funding Availability\"),\"\"),\"\")","v":""},null,null,null,null,null,null,null,"Form Completed By:",null,null,null,null,null,null,null,"Freeze Panes Flag",null,"PromoCodeValue","Color Template"]
[null,null,null,null,null,null,null,null,null,null,null,null,null,null,null,null,null," ",null,null,null,null,null,"Date:",null,null,null,null,null,null,null,false,null,{"$f":"IFERROR(VLOOKUP(PromoInputValue,PromoInputTable,1,FALSE ),0)","v":0},null,null,"Range for Peak Tracking"]
[null,null,null,null,null,null,null,null,null,null,null,null,null,null,null,null,null,null,null,null,null,null,null,null,null,null,null,null,null,null,null,null,null,null,null,null,"P"]
[null,null,null,null,null,null,null,null,null,null,null,null,null,null,null,null,null,null,null,null,null,null,null,null,null,null,null,null,null,null,null,"Copy Line Flag",null,"Import Flag"]
[null,null,{"$f":"FacilityName","v":"Facility Info"},null,null,null,null,null,null,null,null,null,null,null,null,null,null,null,null,null,null,null,null,null,null,null,{"$f":"ProjectName","v":0},null,null,null,null,false,null,false]
[null,null,{"$f":"FacAddressFull","v":""},null,null,null,null,null,null,null,null,null,null,null,"Facility Type:",{"$f":"IF(PremCategory=\"\",\"\",PremCategory&\" - \"&PremType)","v":"Commercial - [Select Premise Type]"},null,null,null,null,null,null,null,"Facility Sq Ft:",{"$f":"IF(App_SqFt=\"\",\"[Enter Facility Size]\",App_SqFt)","v":"[Enter Facility Size]"}]
[]
[]
[]
[null,null,null,"Line #","Location (Area/Room)",null,"Heat Source","Hours/ Year","Existing/ Proposed","Fixture \nID","# of Fixtures","Lighting Technology",null,null,"Fixture Type","# of Lamps / Fixture","Lamp Wattage","Ballast Type","Watts / Fixture","Existing: Notes / Other\nProposed: Mfg / Model #",null,null,"Qualified (Yes/No)","Control Type\n----------\n# of Sensors","Rebate / (Fixt.) or (Lamp)","Maximum Rebate Amount",null,null,null,null,"Fixture Type Code","Error Code","As-Built","Validation Lookup","Promo Active?","Base Rebate ($)","Bonus ($)"]
[null,null,null,1,null,null,null,null,"Exist:",null,null,null,null,null,null,null,null,null,{"$f":"IFERROR(IF(ISNUMBER(MATCH($L17,InputNoLampVal,0)),$P17*VLOOKUP($AE17,InputWattageCode,2,FALSE),IF(OR($L17=\"LED Lamp\",$L17=\"Existing TLED\",$L17=\"TLED (Type A)\",$L17=\"TLED (Type B/C)\"),$P17*$Q17,IF(OR($L17=\"Exit Sign\",$L17=\"Exit Sign (LED)\"),VLOOKUP($AE17,InputWattageCode,2,FALSE),VLOOKUP($AE17,InputWattageCode,$P17+1,FALSE)))),\"\")","v":""},null,null,null,null,null,{"$f":"IFERROR(IF(HLOOKUP(\"Rebate / (Fixt.) or (Lamp)\",RebateDataTable,MATCH($D17,RebateDataLineNumbers,0)+1,FALSE)=\"\",\"\",HLOOKUP(\"Rebate / (Fixt.) or (Lamp)\",RebateDataTable,MATCH($D17,RebateDataLineNumbers,0)+1,FALSE)&\" \")&HLOOKUP(\"Control Rebate / (Fixt) or (Sen)\",RebateDataTable,MATCH($D17,RebateDataLineNumbers,0)+1,FALSE),\"\")","v":""},{"$f":"IFERROR(\nIF(AND(AF17=\"\",AJ17=\"\"),\"\",\nIF(AND(AF17=\"\",OR(AI17=\"\",AK17=0)),$AJ17,\nIF(AF17=\"\",IF(LEN($AJ17)>1,TEXT($AJ17,\"$0,0\"),TEXT($AJ17,\"$0\"))&\nIF($AK17>=10000,\" + \",IF($AK17>1000,\" + (\",\" +(\"))&IF($AK17>10,TEXT($AK17,\"$0,0\"),IF($AK17<1,TEXT($AK17,\"$0.00\"),TEXT($AK17,\"$0\")))&IF($AK17>=10000,\"\",\")\"),\nVLOOKUP($AF17,ErrorCheckingTable,2,FALSE\n)))),\"\")","v":0},null,null,null,null,{"$f":"IFERROR(CONCATENATE(VLOOKUP($L17,ExistingTypeLookup,2,0),\"(\",$Q17,\")\",$R17),\"\")","v":""},{"$f":"HLOOKUP(\"Error Code\",RebateDataTable,MATCH($D17,RebateDataLineNumbers,0)+1,FALSE)","v":""},null,{"$f":"IFERROR(IF(ISNUMBER(FIND(\"T12\",L17)),\"ProposedTypeTechnologyLinT12\",\nIF(VLOOKUP(L17,ExistingTypeLookup,4,FALSE)=\"N\",\"ProposedTypeTechnologyNonLin\",\nIF(VLOOKUP(L17,ExistingTypeLookup,4,FALSE)=\"L\",\"ProposedTypeTechnologyLin\",\nIF(VLOOKUP(L17,ExistingTypeLookup,4,FALSE)=\"E\",\"ProposedTypeTechnologyExit\",\n\"ProposedTypeTechnologyGen\")))),\n\"ProposedTypeTechnologyGen\")","v":"ProposedTypeTechnologyGen"},null,{"$f":"IF(Y17=\" \",\"\",HLOOKUP(\"Base Rebate Amount\",RebateDataTable,MATCH($D17,RebateDataLineNumbers,0)+1,FALSE))","v":0},{"$f":"IFERROR(\nHLOOKUP(\"Lighting $Bonus\",RebateDataTable,MATCH($D17,RebateDataLineNumbers,0)+1,FALSE)\n+HLOOKUP(\"Controls $Bonus\",RebateDataTable,MATCH($D17,RebateDataLineNumbers,0)+1,FALSE),\"\")","v":0}]
[null,null,null,null,null,null,null,null,"Prop:",null,null,null,null,null,null,null,null,null,{"$f":"IFERROR(IF(ISNUMBER(MATCH($L18,InputNoLampVal,0)),$P18*VLOOKUP($AE18,InputWattageCode,2,FALSE),IF(OR($L18=\"LED Lamp\",$L18=\"Existing TLED\",$L18=\"TLED (Type A)\",$L18=\"TLED (Type B/C)\"),$P18*$Q18,IF(OR($L18=\"Exit Sign\",$L18=\"Exit Sign (LED)\"),VLOOKUP($AE18,InputWattageCode,2,FALSE),VLOOKUP($AE18,InputWattageCode,$P18+1,FALSE)))),\"\")","v":""},null,null,null,null,null,null,null,null,{"$f":"IF(AJ17= \"\",0,IF($H17>6000,\"P\",IF(AND($H17>=(HoursOfOperation-200),PeakHours>0),\"P\",IF(AND($G17=\"Exterior\",$H17>4200),\"P\",0))))","v":0},null,null,{"$f":"IFERROR(CONCATENATE(VLOOKUP($L18,ProposedTypeLookup,2,0),\"(\",$Q18,\")\",$R18),\"\")","v":""}]
[null,null,null,{"$f":"$D17+1","v":2},null,null,null,null,"Exist:",null,null,null,null,null,null,null,null,null,{"$f":"IFERROR(IF(ISNUMBER(MATCH($L19,InputNoLampVal,0)),$P19*VLOOKUP($AE19,InputWattageCode,2,FALSE),IF(OR($L19=\"LED Lamp\",$L19=\"Existing TLED\",$L19=\"TLED (Type A)\",$L19=\"TLED (Type B/C)\"),$P19*$Q19,IF(OR($L19=\"Exit Sign\",$L19=\"Exit Sign (LED)\"),VLOOKUP($AE19,InputWattageCode,2,FALSE),VLOOKUP($AE19,InputWattageCode,$P19+1,FALSE)))),\"\")","v":""},null,null,null,null,null,{"$f":"IFERROR(IF(HLOOKUP(\"Rebate / (Fixt.) or (Lamp)\",RebateDataTable,MATCH($D19,RebateDataLineNumbers,0)+1,FALSE)=\"\",\"\",HLOOKUP(\"Rebate / (Fixt.) or (Lamp)\",RebateDataTable,MATCH($D19,RebateDataLineNumbers,0)+1,FALSE)&\" \")&HLOOKUP(\"Control Rebate / (Fixt) or (Sen)\",RebateDataTable,MATCH($D19,RebateDataLineNumbers,0)+1,FALSE),\"\")","v":""},{"$f":"IFERROR(\nIF(AND(AF19=\"\",AJ19=\"\"),\"\",\nIF(AND(AF19=\"\",OR(AI19=\"\",AK19=0)),$AJ19,\nIF(AF19=\"\",IF(LEN($AJ19)>1,TEXT($AJ19,\"$0,0\"),TEXT($AJ19,\"$0\"))&\nIF($AK19>=10000,\" + \",IF($AK19>1000,\" + (\",\" +(\"))&IF($AK19>10,TEXT($AK19,\"$0,0\"),IF($AK19<1,TEXT($AK19,\"$0.00\"),TEXT($AK19,\"$0\")))&IF($AK19>=10000,\"\",\")\"),\nVLOOKUP($AF19,ErrorCheckingTable,2,FALSE\n)))),\"\")","v":0},null,null,null,null,{"$f":"IFERROR(CONCATENATE(VLOOKUP($L19,ExistingTypeLookup,2,0),\"(\",$Q19,\")\",$R19),\"\")","v":""},{"$f":"HLOOKUP(\"Error Code\",RebateDataTable,MATCH($D19,RebateDataLineNumbers,0)+1,FALSE)","v":""},null,{"$f":"IFERROR(IF(ISNUMBER(FIND(\"T12\",L19)),\"ProposedTypeTechnologyLinT12\",\nIF(VLOOKUP(L19,ExistingTypeLookup,4,FALSE)=\"N\",\"ProposedTypeTechnologyNonLin\",\nIF(VLOOKUP(L19,ExistingTypeLookup,4,FALSE)=\"L\",\"ProposedTypeTechnologyLin\",\nIF(VLOOKUP(L19,ExistingTypeLookup,4,FALSE)=\"E\",\"ProposedTypeTechnologyExit\",\n\"ProposedTypeTechnologyGen\")))),\n\"ProposedTypeTechnologyGen\")","v":"ProposedTypeTechnologyGen"},null,{"$f":"IF(Y19=\" \",\"\",HLOOKUP(\"Base Rebate Amount\",RebateDataTable,MATCH($D19,RebateDataLineNumbers,0)+1,FALSE))","v":0},{"$f":"IFERROR(\nHLOOKUP(\"Lighting $Bonus\",RebateDataTable,MATCH($D19,RebateDataLineNumbers,0)+1,FALSE)\n+HLOOKUP(\"Controls $Bonus\",RebateDataTable,MATCH($D19,RebateDataLineNumbers,0)+1,FALSE),\"\")","v":0}]
[null,null,null,null,null,null,null,null,"Prop:",null,null,null,null,null,null,null,null,null,{"$f":"IFERROR(IF(ISNUMBER(MATCH($L20,InputNoLampVal,0)),$P20*VLOOKUP($AE20,InputWattageCode,2,FALSE),IF(OR($L20=\"LED Lamp\",$L20=\"Existing TLED\",$L20=\"TLED (Type A)\",$L20=\"TLED (Type B/C)\"),$P20*$Q20,IF(OR($L20=\"Exit Sign\",$L20=\"Exit Sign (LED)\"),VLOOKUP($AE20,InputWattageCode,2,FALSE),VLOOKUP($AE20,InputWattageCode,$P20+1,FALSE)))),\"\")","v":""},null,null,null,null,null,null,null,null,{"$f":"IF(AJ19= \"\",0,IF($H19>6000,\"P\",IF(AND($H19>=(HoursOfOperation-200),PeakHours>0),\"P\",IF(AND($G19=\"Exterior\",$H19>4200),\"P\",0))))","v":0},null,null,{"$f":"IFERROR(CONCATENATE(VLOOKUP($L20,ProposedTypeLookup,2,0),\"(\",$Q20,\")\",$R20),\"\")","v":""}]
[null,null,null,3,null,null,null,null,"Exist:",null,null,null,null,null,null,null,null,null,{"$f":"IFERROR(IF(ISNUMBER(MATCH($L21,InputNoLampVal,0)),$P21*VLOOKUP($AE21,InputWattageCode,2,FALSE),IF(OR($L21=\"LED Lamp\",$L21=\"TLED (Type A)\",$L21=\"TLED (Type B/C)\"),$P21*$Q21,IF(OR($L21=\"Exit Sign\",$L21=\"Exit Sign (LED)\"),VLOOKUP($AE21,InputWattageCode,2,FALSE),VLOOKUP($AE21,InputWattageCode,$P21+1,FALSE)))),\"\")","v":""},null,null,null,null,null,{"$f":"IFERROR(IF(HLOOKUP(\"Rebate / (Fixt.) or (Lamp)\",RebateDataTable,MATCH($D21,RebateDataLineNumbers,0)+1,FALSE)=\"\",\"\",HLOOKUP(\"Rebate / (Fixt.) or (Lamp)\",RebateDataTable,MATCH($D21,RebateDataLineNumbers,0)+1,FALSE)&\" \")&HLOOKUP(\"Control Rebate / (Fixt) or (Sen)\",RebateDataTable,MATCH($D21,RebateDataLineNumbers,0)+1,FALSE),\"\")","v":""},{"$f":"IFERROR(\nIF(AND(AF21=\"\",AJ21=\"\"),\"\",\nIF(AND(AF21=\"\",OR(AI21=\"\",AK21=0)),$AJ21,\nIF(AF21=\"\",IF(LEN($AJ21)>1,TEXT($AJ21,\"$0,0\"),TEXT($AJ21,\"$0\"))&\nIF($AK21>=10000,\" + \",IF($AK21>1000,\" + (\",\" +(\"))&IF($AK21>10,TEXT($AK21,\"$0,0\"),IF($AK21<1,TEXT($AK21,\"$0.00\"),TEXT($AK21,\"$0\")))&IF($AK21>=10000,\"\",\")\"),\nVLOOKUP($AF21,ErrorCheckingTable,2,FALSE\n)))),\"\")","v":0},null,null,null,null,{"$f":"IFERROR(CONCATENATE(VLOOKUP($L21,ExistingTypeLookup,2,0),\"(\",$Q21,\")\",$R21),\"\")","v":""},{"$f":"HLOOKUP(\"Error Code\",RebateDataTable,MATCH($D21,RebateDataLineNumbers,0)+1,FALSE)","v":""},null,{"$f":"IFERROR(IF(ISNUMBER(FIND(\"T12\",L21)),\"ProposedTypeTechnologyLinT12\",\nIF(VLOOKUP(L21,ExistingTypeLookup,4,FALSE)=\"N\",\"ProposedTypeTechnologyNonLin\",\nIF(VLOOKUP(L21,ExistingTypeLookup,4,FALSE)=\"L\",\"ProposedTypeTechnologyLin\",\nIF(VLOOKUP(L21,ExistingTypeLookup,4,FALSE)=\"E\",\"ProposedTypeTechnologyExit\",\n\"ProposedTypeTechnologyGen\")))),\n\"ProposedTypeTechnologyGen\")","v":"ProposedTypeTechnologyGen"},null,{"$f":"IF(Y21=\" \",\"\",HLOOKUP(\"Base Rebate Amount\",RebateDataTable,MATCH($D21,RebateDataLineNumbers,0)+1,FALSE))","v":0},{"$f":"IFERROR(\nHLOOKUP(\"Lighting $Bonus\",RebateDataTable,MATCH($D21,RebateDataLineNumbers,0)+1,FALSE)\n+HLOOKUP(\"Controls $Bonus\",RebateDataTable,MATCH($D21,RebateDataLineNumbers,0)+1,FALSE),\"\")","v":0}]
[null,null,null,null,null,null,null,null,"Prop:",null,null,null,null,null,null,null,null,null,"",null,null,null,null,null,null,null,null,{"$f":"IF(AJ21= \"\",0,IF($H21>6000,\"P\",IF(AND($H21>=(HoursOfOperation-200),PeakHours>0),\"P\",IF(AND($G21=\"Exterior\",$H21>4200),\"P\",0))))","v":0},null,null,{"$f":"IFERROR(CONCATENATE(VLOOKUP($L22,ProposedTypeLookup,2,0),\"(\",$Q22,\")\",$R22),\"\")","v":""}]
[null,null,null,4,null,null,null,null,"Exist:",null,null,null,null,null,null,null,null,null,"",null,null,null,null,null,{"$f":"IFERROR(IF(HLOOKUP(\"Rebate / (Fixt.) or (Lamp)\",RebateDataTable,MATCH($D23,RebateDataLineNumbers,0)+1,FALSE)=\"\",\"\",HLOOKUP(\"Rebate / (Fixt.) or (Lamp)\",RebateDataTable,MATCH($D23,RebateDataLineNumbers,0)+1,FALSE)&\" \")&HLOOKUP(\"Control Rebate / (Fixt) or (Sen)\",RebateDataTable,MATCH($D23,RebateDataLineNumbers,0)+1,FALSE),\"\")","v":""},{"$f":"IFERROR(\nIF(AND(AF23=\"\",AJ23=\"\"),\"\",\nIF(AND(AF23=\"\",OR(AI23=\"\",AK23=0)),$AJ23,\nIF(AF23=\"\",IF(LEN($AJ23)>1,TEXT($AJ23,\"$0,0\"),TEXT($AJ23,\"$0\"))&\nIF($AK23>=10000,\" + \",IF($AK23>1000,\" + (\",\" +(\"))&IF($AK23>10,TEXT($AK23,\"$0,0\"),IF($AK23<1,TEXT($AK23,\"$0.00\"),TEXT($AK23,\"$0\")))&IF($AK23>=10000,\"\",\")\"),\nVLOOKUP($AF23,ErrorCheckingTable,2,FALSE\n)))),\"\")","v":0},null,null,null,null,{"$f":"IFERROR(CONCATENATE(VLOOKUP($L23,ExistingTypeLookup,2,0),\"(\",$Q23,\")\",$R23),\"\")","v":""},{"$f":"HLOOKUP(\"Error Code\",RebateDataTable,MATCH($D23,RebateDataLineNumbers,0)+1,FALSE)","v":""},null,{"$f":"IFERROR(IF(ISNUMBER(FIND(\"T12\",L23)),\"ProposedTypeTechnologyLinT12\",\nIF(VLOOKUP(L23,ExistingTypeLookup,4,FALSE)=\"N\",\"ProposedTypeTechnologyNonLin\",\nIF(VLOOKUP(L23,ExistingTypeLookup,4,FALSE)=\"L\",\"ProposedTypeTechnologyLin\",\nIF(VLOOKUP(L23,ExistingTypeLookup,4,FALSE)=\"E\",\"ProposedTypeTechnologyExit\",\n\"ProposedTypeTechnologyGen\")))),\n\"ProposedTypeTechnologyGen\")","v":"ProposedTypeTechnologyGen"},null,{"$f":"IF(Y23=\" \",\"\",HLOOKUP(\"Base Rebate Amount\",RebateDataTable,MATCH($D23,RebateDataLineNumbers,0)+1,FALSE))","v":0},{"$f":"IFERROR(\nHLOOKUP(\"Lighting $Bonus\",RebateDataTable,MATCH($D23,RebateDataLineNumbers,0)+1,FALSE)\n+HLOOKUP(\"Controls $Bonus\",RebateDataTable,MATCH($D23,RebateDataLineNumbers,0)+1,FALSE),\"\")","v":0}]
[null,null,null,null,null,null,null,null,"Prop:",null,null,null,null,null,null,null,null,null,"",null,null,null,null,null,null,null,null,{"$f":"IF(AJ23= \"\",0,IF($H23>6000,\"P\",IF(AND($H23>=(HoursOfOperation-200),PeakHours>0),\"P\",IF(AND($G23=\"Exterior\",$H23>4200),\"P\",0))))","v":0},null,null,{"$f":"IFERROR(CONCATENATE(VLOOKUP($L24,ProposedTypeLookup,2,0),\"(\",$Q24,\")\",$R24),\"\")","v":""}]
[null,null,null,5,null,null,null,null,"Exist:",null,null,null,null,null,null,null,null,null,"",null,null,null,null,null,{"$f":"IFERROR(IF(HLOOKUP(\"Rebate / (Fixt.) or (Lamp)\",RebateDataTable,MATCH($D25,RebateDataLineNumbers,0)+1,FALSE)=\"\",\"\",HLOOKUP(\"Rebate / (Fixt.) or (Lamp)\",RebateDataTable,MATCH($D25,RebateDataLineNumbers,0)+1,FALSE)&\" \")&HLOOKUP(\"Control Rebate / (Fixt) or (Sen)\",RebateDataTable,MATCH($D25,RebateDataLineNumbers,0)+1,FALSE),\"\")","v":""},{"$f":"IFERROR(\nIF(AND(AF25=\"\",AJ25=\"\"),\"\",\nIF(AND(AF25=\"\",OR(AI25=\"\",AK25=0)),$AJ25,\nIF(AF25=\"\",IF(LEN($AJ25)>1,TEXT($AJ25,\"$0,0\"),TEXT($AJ25,\"$0\"))&\nIF($AK25>=10000,\" + \",IF($AK25>1000,\" + (\",\" +(\"))&IF($AK25>10,TEXT($AK25,\"$0,0\"),IF($AK25<1,TEXT($AK25,\"$0.00\"),TEXT($AK25,\"$0\")))&IF($AK25>=10000,\"\",\")\"),\nVLOOKUP($AF25,ErrorCheckingTable,2,FALSE\n)))),\"\")","v":0},null,null,null,null,{"$f":"IFERROR(CONCATENATE(VLOOKUP($L25,ExistingTypeLookup,2,0),\"(\",$Q25,\")\",$R25),\"\")","v":""},{"$f":"HLOOKUP(\"Error Code\",RebateDataTable,MATCH($D25,RebateDataLineNumbers,0)+1,FALSE)","v":""},null,{"$f":"IFERROR(IF(ISNUMBER(FIND(\"T12\",L25)),\"ProposedTypeTechnologyLinT12\",\nIF(VLOOKUP(L25,ExistingTypeLookup,4,FALSE)=\"N\",\"ProposedTypeTechnologyNonLin\",\nIF(VLOOKUP(L25,ExistingTypeLookup,4,FALSE)=\"L\",\"ProposedTypeTechnologyLin\",\nIF(VLOOKUP(L25,ExistingTypeLookup,4,FALSE)=\"E\",\"ProposedTypeTechnologyExit\",\n\"ProposedTypeTechnologyGen\")))),\n\"ProposedTypeTechnologyGen\")","v":"ProposedTypeTechnologyGen"},null,{"$f":"IF(Y25=\" \",\"\",HLOOKUP(\"Base Rebate Amount\",RebateDataTable,MATCH($D25,RebateDataLineNumbers,0)+1,FALSE))","v":0},{"$f":"IFERROR(\nHLOOKUP(\"Lighting $Bonus\",RebateDataTable,MATCH($D25,RebateDataLineNumbers,0)+1,FALSE)\n+HLOOKUP(\"Controls $Bonus\",RebateDataTable,MATCH($D25,RebateDataLineNumbers,0)+1,FALSE),\"\")","v":0}]
[null,null,null,null,null,null,null,null,"Prop:",null,null,null,null,null,null,null,null,null,"",null,null,null,null,null,null,null,null,{"$f":"IF(AJ25= \"\",0,IF($H25>6000,\"P\",IF(AND($H25>=(HoursOfOperation-200),PeakHours>0),\"P\",IF(AND($G25=\"Exterior\",$H25>4200),\"P\",0))))","v":0},null,null,{"$f":"IFERROR(CONCATENATE(VLOOKUP($L26,ProposedTypeLookup,2,0),\"(\",$Q26,\")\",$R26),\"\")","v":""}]
[null,null,null,null,null,null,null,null,null,null,null,null,null,null,null,null,null,null,null,null,null,null,null,null,{"$f":"IF(MaxRebate>=RebateCap,\"Sub Total Rebate (Max):\",\"Sub Total Rebate:\")","v":"Sub Total Rebate:"},{"$f":"MIN(BaseRebateLighting+BaseRebateControls+BaseRebateRemoval)","v":0}]
[null,null,null,null,null,null,null,null,null,null,null,null,null,null,null,null,null,null,null,null,null,null,null,null,"Promotional Bonus:",{"$f":"IF(PromoCodeValid=\"Valid\",BonusRebateLighting+BonusRebateControls,\"\")","v":{"$error":"#NAME?"}}]
[null,null,null,null,null,null,null,null,null,null,null,null,null,null,null,null,null,null,null,"Existing Energy Use as a % of Facility Total Electrical Use: ",{"$f":"IFERROR(\nIF(ExistingUse=0,\"\",\nIF(SUM(FacilityTotalKWH)>0,\n  IF(ROUND(ExistingUse/FacilityTotalKWH,2)<0.01,\"< 1%\",\n  ROUND(ExistingUse/FacilityTotalKWH,2)),\nIF(SUM(App_EstkWh)>0,\n  IF(ROUND(ExistingUse/App_EstkWh,2)<0.01,\"<1%\",\n  ROUND(ExistingUse/App_EstkWh,2)),\n\"\"))),\"\")","v":""},null,null,null,{"$f":"IF(MaxRebate>=RebateCap,\"Total Rebate (100% Cost):\",\"Total Rebate:\")","v":"Total Rebate:"},{"$f":"IF(AND(SUM(BaseIncentiveCols)>0,TotalCost=0),\"Cost?\",MIN(MaxRebate,RebateCap))","v":0}]
[]
[]
[null,null,"Cost Information:",null,null,null,null,null,null,null,null,null,null,null,null,null,null,null,null,null,null,null,null,null,null,null,null,null,null,null,null,"Material AsBuilt Flag"]
[null,null,null,"Fixture Material Cost",null,null,null,"Labor Cost",null,null,"Misc. Cost (permit, etc.)",null,null,null,"Subtotal",null,"Tax Rate",null,{"$f":"IF(OR($H$34=\"\",$H$34=0),\"Total Material Cost\",\"Total Installed Cost\")","v":"Total Material Cost"},null,null,"Total Bid Cost (incl. sales tax)",null,null,null,null,null,null,null,null,null,"Labor AsBuilt Flag"]
[null,null,null,null,null,null,null,null,null,null,null,null,null,null,{"$f":"IF(AND(LIF_TotCost=\"\",LIF_MatCost<>\"\"),SUM(LIF_MatCost,LIF_LabCost,LIF_MisCost),\"-\")","v":"-"},null,null,null,{"$f":"IFERROR(IF(LIF_TotCost=\"\",LIF_Subtotal*(1+IF(LIF_TaxRate=\"Tax Exempt\",0,LIF_TaxRate)),\"-\"),\"\")","v":""},null,"OR",null,null,null,null,null,null,null,null,null,null,"Misc AsBuilt Flag"]
[null,null,null,null,null,null,null,null,null,null,null,null,null,null,null,null,null,null,null,null,null,null,null,null,null,null,null,null,null,null,null,"Tax Rate"]
[null,null,null,null,null,null,null,null,null,null,null,null,null,null,null,null,null,null,null,null,null,null,null,null,null,null,null,null,null,null,null,"Total AsBuilt Flag"]
[null,null," Notes:"]
[null,null,null,null,null,null,null,null,null,null,null,null,null,null,null,null,null,null,null,null,null,null,null,null,null,null,null,null,null,null,null,null,"As Built?"]
[null,null,null,null,null,null,null,null,null,null,null,null,null,null,null,null,null,null,null,null,null,null,null,null,null,null,null,{"$f":"Version","v":"Version April 2025 - Effective Date April 1st, 2025"},null,null,null,null,{"$f":"IF(COUNTIF(AsBuiltInputTable,\"=AS-BUILT\")+COUNTIF(AsBuiltCostTable,\"=AS-BUILT\")>0,\"AS-BUILT\",\"\")","v":""}]

{"sheet":"Lighting Retrofit Summary","index":5,"n_rows":49,"n_cols":28,"rows_kept":49,"cut":false,"hidden":false,"merged":[[2,2,2,21],[5,19,5,20],[6,19,6,20],[7,19,7,20],[4,19,4,20],[4,2,5,9]]}
[]
[]
[null,null,{"$f":"BannerText","v":"Energy Services  ●  eebiz@snopud.com  ●  www.snopud.com"}]
[]
[null,null,"Lighting Retrofit Summary",null,null,null,null,null,null,null,null,null,null,null,null,null,null,null,"Promo Code: ",{"$f":"PromoInputValue","v":0}]
[null,null,null,null,null,null,null,null,null,null,null,{"$f":"AsBuiltFlag","v":""},null,null,null,null,null,null,"PUD Staff:",{"$f":"AssignedStaff","v":0}]
[null,null,"For Energy Efficiency Projects in Commercial & Industrial Facilities.",null,null,null,null,null,null,null,null,null,null,null,null,null,null,null,"Form Completed By: ",{"$f":"LIF_CompletedBy","v":0}]
[null,null,null,null,null,null,null,null,null,null,null,null,null,null,null,null,null,null,"Date: ",{"$f":"LIF_Date","v":"00:00:00"}]
[]
[]
[null,null,{"$f":"FacilityName","v":"Facility Info"},null,null,null,null,null,null,null,null,null,null,null,null,null,null,null,null,null,null,{"$f":"ProjectName","v":0}]
[null,null,{"$f":"FacAddressFull","v":""}]
[]
[null,null,null,null,null,null,null,null,null,null,null,null,null,null,null,null,null,null,null,null,null,null,null,null,null,null,"Pivot Filter","ShowDetails"]
[null,null,null,"Estimated Electrical Energy Use & Proposed Savings",null,null,null,null,null,null,null,"Project Retrofit Summary Table",null,null,null,null,null,null,null,null,null,null,null,null,null,null,"Rebate Type Description",true]
[null,null,null,"Existing Energy Use:",null,null,null,null,{"$f":"ExistingUse","v":0},null,null,null,"(E)# of Fixts","(E)# of Lamps","(P)# of Fixts","(P)# of Lamps","kW Reduction","Lighting kWh/Yr. Savings","Controls kWh/Yr. Savings","Lighting Rebate Amount","Controls Rebate Amount",null,null,null,"X"]
[null,null,null,null,"Lighting Retrofit Savings:",null,null,null,{"$f":"KWhSavingsLighting","v":0},null,null,"Total","---","---","---","---","---","---","---","---","---",null,null,null,"X"]
[null,null,null,null,"Lighting Controls Savings:",null,null,null,{"$f":"IF(KWhSavingsControls=0,\"---\",KWhSavingsControls)","v":"---"},null,null,null,null,null,null,null,null,null,null,null,null,null,null,null,"X"]
[null,null,null,null,"Total Electrical Energy Savings:",null,null,null,{"$f":"SUM(KWhSavingsLighting,KWhSavingsControls)","v":0},null,null,null,null,null,null,null,null,null,null,null,null,null,null,null,"X"]
[null,null,null,"Proposed Energy Use:",null,null,null,null,{"$f":"ProposedUse","v":0},null,null,null,null,null,null,null,null,null,null,null,null,null,null,null,"X"]
[null,null,null,"% Savings:",null,null,null,null,{"$f":"IFERROR(TotalSavings/ExistingUse,\"\")","v":""},null,null,null,null,null,null,null,null,null,null,null,null,null,null,null,"X"]
[null,null,null,"Electrical Demand / Load Reduction:",null,null,null,null,{"$f":"kWReduction","v":0},null,null,null,null,null,null,null,null,null,null,null,null,null,null,null,"X"]
[null,null,null,null,null,null,null,null,null,null,null,null,null,null,null,null,null,null,null,null,null,null,null,null,"X"]
[null,null,null,"Project Cost & Rebate",null,null,null,null,null,null,null,null,null,null,null,null,null,null,null,null,null,null,null,null,"X"]
[null,null,null,{"$f":"IF('Lighting Input Form'!$V$34<>\"\",\"Total Bid Cost:\",IF(OR('Lighting Input Form'!$H$34=\"\",'Lighting Input Form'!$H$34=0),\"Total Material Cost:\",\"Total Installed Cost:\"))","v":"Total Material Cost:"},null,null,null,null,{"$f":"SUM(IF(LIF_TotCost<>\"\",LIF_TotCost,LIF_TotCostDetailed),N(\"Use Sum to force NUMBER data type\"))","v":0},null,null,null,null,null,null,null,null,null,null,null,null,null,null,null,"X"]
[null,null,null,"Cost Type:",null,null,null,null,{"$f":"IF(OR(LIF_LabCost<>\"\",LIF_TotCost<>\"\"),\"Total\",\"Material\")","v":"Material"},null,null,null,null,null,null,null,null,null,null,null,null,null,null,null,"X"]
[null,null,null,{"$f":"IF('Lighting Input Form'!$V$34<>\"\",\"Bid Cost Averaged per Fixture:\",IF(OR('Lighting Input Form'!$H$34=\"\",'Lighting Input Form'!$H$34=0),\"Average Material Cost per Fixture:\",\"Average Installed Cost per Fixture:\"))","v":"Average Material Cost per Fixture:"},null,null,null,null,{"$f":"IFERROR(TotalCost/NumFixtsProposed,\"---\")","v":"---"},null,null,null,null,null,null,null,null,null,null,null,null,null,null,null,"X"]
[null,null,null,"Lighting Retrofit Rebate Amount:",null,null,null,null,{"$f":"IFERROR(SUM(BaseRebateLighting,BaseRebateRemoval),\"\")","v":0},null,null,null,null,null,null,null,null,null,null,null,null,null,null,null,"X"]
[null,null,null,null,"Lighting Promotional Bonus:",null,null,null,{"$f":"IFERROR(IF(BonusRebateLighting=0,\"---\",BonusRebateLighting),\"---\")","v":"---"}]
[null,null,null,"Lighting Controls Rebate Amount:",null,null,null,null,{"$f":"IFERROR(IF(BaseRebateControls=0,\"---\",BaseRebateControls),\"---\")","v":"---"},null,null,null,null,null,null,null,null,null,null,null,null,null,null,null,"X"]
[null,null,null,null,"Controls Promotional Bonus:",null,null,null,{"$f":"IFERROR(IF(BonusRebateControls=0,\"---\",BonusRebateControls),\"---\")","v":"---"}]
[null,null,null,"Project Rebate Amount:",null,null,null,null,{"$f":"MIN(MaxRebate,TotalCost,RebateCap)","v":0},null,null,null,null,null,null,null,null,null,null,null,null,null,null,null,"X"]
[null,null,null,"Project Development Incentive:",null,null,null,null,{"$f":"IF(TotalCost<>\"\",ProjDevIncentive,\"---\")","v":50}]
[null,null,null,{"$f":"IF('Lighting Input Form'!$V$34<>\"\",\"Rebate as a % of Total Bid Cost:\",IF(OR('Lighting Input Form'!$H$34=\"\",'Lighting Input Form'!$H$34=0),\"Rebate as a % of Total Material Cost:\",\"Rebate as a % of Total Installed Cost:\"))","v":"Rebate as a % of Total Material Cost:"},null,null,null,null,{"$f":"IFERROR(IncentiveAmount/TotalCost,\"---\")","v":"---"},null,null,null,null,null,null,null,null,null,null,null,null,null,null,null,"X"]
[null,null,null,"Average Rebate Amount per Fixture:",null,null,null,null,{"$f":"IFERROR(IncentiveAmount/NumFixtsProposed,\"\")","v":""},null,null,null,null,null,null,null,null,null,null,null,null,null,null,null,"X"]
[null,null,null,"Rebate Amount per kWh",null,null,null,null,{"$f":"IFERROR(IncentiveAmount/TotalSavings,\"\")","v":""},null,null,null,null,null,null,null,null,null,null,null,null,null,null,null,"X"]
[null,null,null,null,null,null,null,null,null,null,null,null,null,null,null,null,null,null,null,null,null,null,null,null,"X"]
[null,null,null,"Customer's Project Economic Analysis",null,null,null,null,null,null,null,null,null,null,null,null,null,null,null,null,null,null,null,null,"X"]
[null,null,null,null,null,null,"Cost per kWh (Elec. Demand):",8.8499999999999995E-2,{"$f":"IF(MAX(TrackingPeakkW)>100,5.95,0.00001)","v":1.0000000000000001E-5},null,null,null,null,null,null,null,null,null,null,null,null,null,null,null,"X"]
[null,null,null,"Est. Annual Electrical Cost Savings:",null,null,null,null,{"$f":"SUM((TotalSavings*kWhRate),(kWReduction*kWRate*12))","v":0},null,null,null,null,null,null,null,null,null,null,null,null,null,null,null,"X"]
[null,null,null,"Customer's Net Cost:",null,null,null,null,{"$f":"IFERROR(TotalCost-IncentiveAmount,\"\")","v":0},null,null,null,null,null,null,null,null,null,null,null,null,null,null,null,"X"]
[null,null,null,"Simple Payback (w/o Rebate):",null,null,null,null,{"$f":"IFERROR(\nIF(TotalCost/EstAnnualCostSavings>20,\"20+ Years\",\nTotalCost/EstAnnualCostSavings),\"\")","v":""},null,null,null,null,null,null,null,null,null,null,null,null,null,null,null,"X"]
[null,null,null,"Return on Investment (ROI) (w/o Rebate):",null,null,null,null,{"$f":"IFERROR(1/ProjSimplePaybackNoRebate,\"\")","v":""},null,null,null,null,null,null,null,null,null,null,null,null,null,null,null,"X"]
[null,null,null,"Simple Payback (w/ Rebate):",null,null,null,null,{"$f":"IFERROR(\nIF(CustNetCost/EstAnnualCostSavings>20,\"20+ Years\",\nCustNetCost/EstAnnualCostSavings),\"\")","v":""},null,null,null,null,null,null,null,null,null,null,null,null,null,null,null,"X"]
[null,null,null,"Return on Investment (ROI) (w/ Rebate):",null,null,null,null,{"$f":"IFERROR(1/ProjSimplePayback_Rebate,\"\")","v":""},null,null,null,null,null,null,null,null,null,null,null,null,null,null,null,"X"]
[null,null,null,null,null,null,null,null,null,null,null,null,null,null,null,null,null,null,null,null,null,null,null,null,"X"]
[null,null,null,null,null,null,null,null,null,null,null,null,null,null,null,null,null,null,null,null,null,null,null,null,"X"]
[null,null,null,null,null,null,null,null,null,null,null,null,null,null,null,null,null,null,null,null,null,null,null,null,"X"]
[null,null,null,null,null,null,null,null,null,null,null,null,null,null,null,null,null,null,null,null,null,null,null,null,"X"]

{"sheet":"Lighting Retrofit Worksheet","index":6,"n_rows":31,"n_cols":120,"rows_kept":31,"cut":false,"hidden":false,"merged":[[27,2,27,113],[28,2,28,113],[29,2,29,113],[15,39,15,59],[25,55,25,59],[25,33,25,34],[15,60,15,64],[15,65,15,66],[15,67,15,69],[15,70,15,75],[15,94,15,103],[2,2,2,113],[13,36,13,38],[15,76,15,78],[15,36,15,38],[15,6,15,35],[5,111,5,112],[6,111,6,112],[7,111,7,112],[4,111,4,112],[4,2,5,32]]}
[]
[]
[null,null,{"$f":"BannerText","v":"Energy Services  ●  eebiz@snopud.com  ●  www.snopud.com"}]
[]
[null,null,"Lighting Retrofit Worksheet",null,null,null,null,null,null,null,null,null,null,null,null,null,null,null,null,null,null,null,null,null,null,null,null,null,null,null,null,null,null,null,null,null,null,null,null,null,null,null,null,null,null,null,null,null,null,null,null,null,null,null,null,null,null,null,null,null,null,null,null,null,null,null,null,null,null,null,null,null,null,null,null,null,null,null,null,null,null,null,null,null,null,null,null,null,null,null,null,null,null,null,null,null,null,null,null,null,null,null,null,null,null,null,null,null,null,null,"Promo Code: ",{"$f":"PromoInputValue","v":0}]
[null,null,null,null,null,null,null,null,null,null,null,null,null,null,null,null,null,null,null,null,null,null,null,null,null,null,null,null,null,null,null,null,null,null,null,null,null,null,null,null,null,null,null,null,null,null,null,null,null,null,null,null,null,null,null,{"$f":"AsBuiltFlag","v":""},null,null,null,null,null,null,null,null,null,null,null,null,null,null,null,null,null,null,null,null,null,null,null,null,null,null,null,null,null,null,null,null,null,null,null,null,null,null,null,null,null,null,null,null,null,null,null,null,null,null,null,null,null,null,"PUD Staff:",{"$f":"AssignedStaff","v":0},null,null,null,null,null,null,null,false]
[null,null,"For Energy Efficiency Projects in Commercial & Industrial Facilities.",null,null,null,null,null,null,null,null,null,null,null,null,null,null,null,null,null,null,null,null,null,null,null,null,null,null,null,null,null,null,null,null,null,null,null,null,null,null,null,null,null,null,null,null,null,null,null,null,null,null,null,null,null,null,null,null,null,null,null,null,null,null,null,null,null,null,null,null,null,null,null,null,null,null,null,null,null,null,null,null,null,null,null,null,null,null,null,null,null,null,null,null,null,null,null,null,null,null,null,null,null,null,null,null,null,null,null,"Form Completed By: ",{"$f":"LIF_CompletedBy","v":0}]
[null,null,null,null,null,null,null,null,null,null,null,null,null,null,null,null,null,null,null,null,null,null,null,null,null,null,null,null,null,null,null,null,null,null,null,null,null,null,null,null,null,null,null,null,null,null,null,null,null,null,null,null,null,null,null,null,null,null,null,null,null,null,null,null,null,null,null,null,null,null,null,null,null,null,null,null,null,null,null,null,null,null,null,null,null,null,null,null,null,null,null,null,null,null,null,null,null,null,null,null,null,null,null,null,null,null,null,null,null,null,"Date: ",{"$f":"LIF_Date","v":"00:00:00"}]
[]
[]
[null,null,{"$f":"FacilityName","v":"Facility Info"},null,null,null,null,null,null,null,null,null,null,null,null,null,null,null,null,null,null,null,null,null,null,null,null,null,null,null,null,null,null,null,null,null,null,null,null,null,null,null,null,null,null,null,null,null,null,null,null,null,null,null,null,null,null,null,null,null,null,null,null,null,null,null,null,null,null,null,null,null,null,null,null,null,null,null,null,null,null,null,null,null,null,null,null,null,null,null,null,null,null,null,null,null,null,null,null,null,null,null,null,null,null,null,null,null,null,null,null,null,null,{"$f":"ProjectName","v":0}]
[null,null,{"$f":"FacAddressFull","v":""}]
[]
[null,null,null,"Light Fixture Rebate Data & Calculations"]
[]
[null,null,null,null,null,null,"Lighting",null,null,null,null,null,null,null,null,null,null,null,null,null,null,null,null,null,null,null,null,null,null,null,null,null,null,null,null,null,"Controls",null,null,"Customer Savings (Existing vs. Proposed)",null,null,null,null,null,null,null,null,null,null,null,null,null,null,null,null,null,null,null,null,"BPA Baseline Adjustments",null,null,null,null,"Inelligible",null,"Incented vs. Non-Incented Savings",null,null,"Lighting Lookup Code",null,null,null,null,null,"Controls Lookup Code",null,null,null,null,null,null,null,null,null,null,null,null,null,null,null,null,null,"Promotion Information"]
[null,null,null,"Line #","Heat Source","Hours/ Year","(E) # of Fixts","(P) # of Fixts","Location (Area/Room)","(E) Fixture ID","(E) Fixture Type","(E) Lighting Technology","(E) # of Lamps","(E) # of Lamps Total","(E) Lamp Wattage","(E) Ballast Type","(E) Watts Per Fixture","(E)\nkW\n(Load)","(E) Description","(P) Fixture ID","(P)\nFixture Type","(P) Lighting Technology","(P) # of Lamps","(P) # of Lamps Total","(P) Lamp Wattage","(P) Ballast Type","(P) Watts Per Fixture","(P)\nkW (Load)","(P) Description","Qualified (Yes/No)","Retrofit Description (Detailed)","Retrofit Description","Retrofit Type","\n% Reduct for Burnouts","Wattage Reduct  / Fixture","Wattage Reduct  / Lamp","Control Type","# of Sens","% Hrs Red","kW\n(Load) Reduct","Peak kW (Load) Reduction","Mon Morning Peak kW Reduction","Mon Evening Peak 1 kW Reduction","Mon Evening Peak 2 kW Reduction","Tues Morning Peak kW Reduction","Tues Evening Peak 1 kW Reduction","Tues Evening Peak 2 kW Reduction","Wed Morning Peak kW Reduction","Wed Evening Peak 1 kW Reduction","Wed Evening Peak 2 kW Reduction","Thurs Morning Peak kW Reduction","Thurs Evening Peak 1 kW Reduction","Thurs Evening Peak 2 kW Reduction","(E)\nkWh/Yr\n(Use)","(P)\nkWh/Yr\n(Use)","kWh/Yr Savings","HVAC Adjustment Factor","Lighting kWh/Yr Savings","Contrls kWh/Yr Savings","HVAC Adjusted kWh/Yr Savings","Adjusted Watts per Lamp ","Adjusted Watts per Fixture ","Adjusted kW (Load) Baseline","Non-Reported kW (Load) Reduction","Non-Reported kWh/Yr Savings","Inelligible kW\n(Load)\nReduction","Inelligible kWh/Yr Savings","Incented kW (Load) Reduction","Incented kWh/Yr Savings","Non-Incented kWh/Yr Savings","Rebate Type Code","Rebate Type Description","Rebate\nRetrofit Type Code","Rebate Wattage Reduction Code","Rebate\nHours Code","Rebate\nProposed Tech. Type Code","Type Code","Controls Hours Code","Wattage Range Code","Lighting Lookup Code","Lighting Lookup Value","Lighting Rebate / (Fixt.) or (Lamp)","Lighting Base Rebate","Lighting Total Rebate","Controls Lookup Code","Controls Rebate / Fixt","Controls Rebate / Sensor","Controls Rebate (Fixt)","Controls Rebate / Sensor","Controls Base Rebate","Controls Total Rebate","Remove\nLookup Code","Remove Rebate / (Fixt.)","Removal Base Rebate","Rebate Type Check","Retrofit Type Check","Heat Source Check","Controls Bonus Check","Other Checks","Lighting %Bonus","Lighting $Bonus","Controls %Bonus","Controls $Bonus","Base Rebate Amount","Project Development Rebate","Error Code","Ltg Qty","Rebate Lookup Code(s)","Rebate / (Fixt.) or (Lamp)","Control Rebate / (Fixt) or (Sen)","Bonus Amount","Base Rebate Amount","Maximum Rebate Amount",null,null,null,null,null,"Extra Incentive Increase",1]
[null,null,null,1,{"$f":"HLOOKUP(E$17,InputTable,MATCH($D18,InputLineNumbers,0)+1,FALSE)","v":0},0,{"$f":"HLOOKUP(\"# of Fixtures\",InputTable,MATCH($D18,InputLineNumbers,0)+1,FALSE)","v":0},{"$f":"IF(OR($BX18=\"C\",$BX18=\"X\"),G18,\nHLOOKUP(\"# of Fixtures\",InputTable,MATCH($D18,InputLineNumbers,0)+2,FALSE))","v":0},{"$f":"HLOOKUP(I$17,InputTable,MATCH($D18,InputLineNumbers,0)+1,FALSE)","v":0},{"$f":"IFERROR(IF(HLOOKUP(\"Fixture \nID\",InputTable,MATCH($D18,InputLineNumbers,0)+1,FALSE)<>\"\",\nHLOOKUP(\"Fixture \nID\",InputTable,MATCH($D18,InputLineNumbers,0)+1,FALSE),\nIF(SUM(Q18)>0,\"Non-Tagged\",\"---\")),\"\")","v":"---"},{"$f":"HLOOKUP(\"Fixture Type\",InputTable,MATCH($D18,InputLineNumbers,0)+1,FALSE)","v":0},{"$f":"HLOOKUP(\"Lighting Technology\",InputTable,MATCH($D18,InputLineNumbers,0)+1,FALSE)","v":0},{"$f":"HLOOKUP(\"# of Lamps / Fixture\",InputTable,MATCH($D18,InputLineNumbers,0)+1,FALSE)","v":0},{"$f":"G18*M18","v":0},{"$f":"HLOOKUP(\"Lamp Wattage\",InputTable,MATCH($D18,InputLineNumbers,0)+1,FALSE)","v":0},{"$f":"HLOOKUP(\"Ballast Type\",InputTable,MATCH($D18,InputLineNumbers,0)+1,FALSE)","v":0},{"$f":"N(HLOOKUP(\"Watts / Fixture\",InputTable,MATCH($D18,InputLineNumbers,0)+1,FALSE))","v":0},{"$f":"IFERROR(($G18*$Q18*(1-MAX(0,$AH18-0.1)))/1000,\"\")","v":0},{"$f":"IF($L18=0,\"\",\nIF($L18=\"Other (Specify in Notes)\",\n    CONCATENATE($Q18,\"W \",LEFT($L18,5)),\nIF($L18=\"Specialty Lighting\",\n   CONCATENATE(Q18,\"W \",\"Specialty Lighting\"),\nIF(OR($L18=\"Existing LED\",\n           $L18=\"Linear (Other)\",\n           $L18=\"HID (Other)\",\n           $L18=\"eHID\",\n           $L18=\"Plasma\",\n           $L18=\"Induction\"),\n           CONCATENATE($Q18,\"W \",$L18),\nIF(OR($L18=\"Metal Halide\",\n           $L18=\"Ceramic Metal Halide\",\n           $L18=\"High Pressure Sodium\",\n           $L18=\"Low Pressure Sodium\",\n           $L18=\"Mecury Vapor\",\n           $L18=\"Exit Sign\"),\n           CONCATENATE($O18,\" \",VLOOKUP($L18,ExistingTypeLookup,2,FALSE)),\nIF($L18=\"Compact Fluor Lamp\",\n     CONCATENATE(\"(\",$M18,\"L) \",$O18,\" \",VLOOKUP($L18,ExistingTypeLookup,2,FALSE)),\nIF($L18=\"Compact Fluor Fixture / Kit\",\n    CONCATENATE(\"(\",$M18,\"L) \",$O18,\" \",\"CFL Fixture / Kit\"),\nIF(OR($L18=\"Incandescent (A , BR, etc.)\",\n           $L18=\"Incandescent (BR, G, etc.)\"),\n           CONCATENATE(\"(\",$M18,\"L) \",$O18,\" \",LEFT($L18,12)),\nIF($L18=\"Halogen (PAR, MR16, etc.)\",\n    CONCATENATE(\"(\",$M18,\"L) \",$O18,\" \",LEFT($L18,7)),\nIF($L18=\"Existing TLED\",\n    CONCATENATE(\"(\",$M18,\"L) \",$O18,\"W \",$L18),\nIF($L18=\"Ceramic MH (PAR, MR16, etc.)\",\n    CONCATENATE(\"(\",$M18,\"L) \",$O18,\" \",LEFT($L18,11),\" Lamp\"),\nIF(ISNUMBER(FIND(\"Linear Fluor -\",$L18,1)),\n    CONCATENATE(\"(\",$M18,\"L) \",$O18,\" \",RIGHT($L18,LEN($L18)-15)),\nCONCATENATE(\"(\",$M18,\"L) \",$O18,\" \",$L18)))))))))))))","v":""},{"$f":"IFERROR(IF(HLOOKUP(\"Fixture \nID\",InputTable,MATCH($D18,InputLineNumbers,0)+2,FALSE)<>\"\",\nHLOOKUP(\"Fixture \nID\",InputTable,MATCH($D18,InputLineNumbers,0)+2,FALSE),\nIF(V18=\"**Lighting Controls Only**\",\"Lighting Controls\",\nIF(V18=\"**Fixture Removal Only**\",\"Fixture Removal\",\nIF(V18=\"**Existing to Remain**\",\"Existing to Remain\",\nIF(SUM(AA18)>0,\"Non-Tagged\",\"---\"))))),\"\")","v":"---"},{"$f":"HLOOKUP(\"Fixture Type\",InputTable,MATCH($D18,InputLineNumbers,0)+2,FALSE)","v":0},{"$f":"HLOOKUP(\"Lighting Technology\",InputTable,MATCH($D18,InputLineNumbers,0)+2,FALSE)","v":0},{"$f":"HLOOKUP(\"# of Lamps / Fixture\",InputTable,MATCH($D18,InputLineNumbers,0)+2,FALSE)","v":0},{"$f":"W18*H18","v":0},{"$f":"HLOOKUP(\"Lamp Wattage\",InputTable,MATCH($D18,InputLineNumbers,0)+2,FALSE)","v":0},{"$f":"HLOOKUP(\"Ballast Type\",InputTable,MATCH($D18,InputLineNumbers,0)+2,FALSE)","v":0},{"$f":"HLOOKUP(\"Watts / Fixture\",InputTable,MATCH($D18,InputLineNumbers,0)+2,FALSE)","v":""},{"$f":"IFERROR(\nIF($BX18=\"R\",0,\nIF(OR($BX18=\"X\",$BX18=\"C\"),$R18,\n$H18*$AA18/1000)),\n\"\")","v":""},{"$f":"IF(OR($V18=\"LED Fixt / Kit\",$V18=\"LED Kit\",$V18=\"LED Fixture\",$V18=\"LED Components\",$V18=\"Exit Sign\"),CONCATENATE($AA18,\"W \",$V18),\nIF($V18=0,\"\",\nIF(OR($V18=\"**Lighting Controls Only**\",$V18=\"**Fixture Removal Only**\",$V18=\"**Existing to Remain**\"),$V18,\nIF(OR($V18=\"LED Lamp\",$V18=\"TLED (Type A)\",$V18=\"TLED (Type B/C)\"),CONCATENATE(\"(\",$W18,\"L)\",\" \",$Y18,\"W \",$V18),))))","v":""},{"$f":"HLOOKUP(AD$17,InputTable,MATCH($D18,InputLineNumbers,0)+1,FALSE)","v":0},{"$f":"IF(AND($S18=\"\",$AC18=\"\"),\"\",CONCATENATE($S18,\" → \",$AC18))","v":""},{"$f":"IFERROR(IF(OR($BX18=\"C\",$BX18=\"R\"),CONCATENATE(\"*\",VLOOKUP($V18,ProposedTypeLookup,3,FALSE),\"*\"),\nIF($BX18=\"X\",CONCATENATE(\"*(E) to \",VLOOKUP($V18,ProposedTypeLookup,3,FALSE),\"*\"),\nCONCATENATE(VLOOKUP($L18,ExistingTypeLookup,2,FALSE),\" to \",VLOOKUP($V18,ProposedTypeLookup,2,FALSE)))),\"\")","v":""},{"$f":"IFERROR(\nIF(OR(V18=\"**Fixture Removal Only**\",V18=\"**Lighting Controls Only**\",V18=\"**Existing to Remain**\"),\"-\",\nVLOOKUP(V18,ProposedTypeLookup,3,FALSE)),\n\"-\")","v":"-"},null,{"$f":"IFERROR(ROUND(IF($G18<$H18,($AN18*1000)/$G18,($AN18*1000)/$H18),0),\"-\")","v":"-"},{"$f":"IFERROR(IF(AND($BS18=\"L\",AND($L18=\"Linear (Other)\",$BU18=\"L\")),ROUND($AI18/$W18,0),\nIF(OR(AND($BS18=\"L\",$BU18=\"L\"),AND($BS18=\"L\",$BU18=\"LD\")),ROUND($AI18/$W18,0),\nIF(AND($BS18=\"4'T12-L\",OR($BU18=\"L\",$BU18=\"LD\")),ROUND($AI18/$W18,0),\nIF(AND($BS18=\"N\",$BU18=\"L\"),ROUND($AI18/$W18,0),\"-\")))),\"\")","v":"-"},{"$f":"IF(HLOOKUP(\"Control Type\n----------\n# of Sensors\",InputTable,MATCH($D18,InputLineNumbers,0)+1,FALSE)=\"\",\"-\",HLOOKUP(\"Control Type\n----------\n# of Sensors\",InputTable,MATCH($D18,InputLineNumbers,0)+1,FALSE))","v":"-"},{"$f":"IF(HLOOKUP(\"Control Type\n----------\n# of Sensors\",InputTable,MATCH($D18,InputLineNumbers,0)+2,FALSE)=\"\",\"-\",HLOOKUP(\"Control Type\n----------\n# of Sensors\",InputTable,MATCH($D18,InputLineNumbers,0)+2,FALSE))","v":"-"},{"$f":"IFERROR(IF(VLOOKUP(AK18,ExistingTypeLookupControls,2,FALSE)=\"\",\"-\",VLOOKUP(AK18,ExistingTypeLookupControls,2,FALSE)),\"-\")","v":"-"},{"$f":"IFERROR(IF($BX18=\"R\",$R18,IF($AB18=0,0,$R18-$AB18)),0)","v":0},{"$f":"IF(INDEX(PeakOverride,$D18*2,1)=\"P\",$AN18,\n0)","v":0},{"$f":"IF($AO18=0,0,\nIF($F18>8000,$AN18,\nIF(AND($F18>=(HoursOfOperation-200),MonMornPeak=1),$AN18,\nIF(AND($E18=\"Exterior\",$F18>=4200),$AN18*0.5,\n0))))","v":0},{"$f":"IF($AO18=0,0,\nIF($F18>8000,$AN18,\nIF(AND($F18>=(HoursOfOperation-200),MonEvePeak1=1),$AN18,\nIF(AND($E18=\"Exterior\",$F18>=4200),$AN18,\n0))))","v":0},{"$f":"IF($AO18=0,0,\nIF($F18>8000,$AN18,\nIF(AND($F18>=(HoursOfOperation-200),MonEvePeak2=1),$AN18,\nIF(AND($E18=\"Exterior\",$F18>=4200),$AN18,\n0))))","v":0},{"$f":"IF($AO18=0,0,\nIF($F18>8000,$AN18,\nIF(AND($F18>=(HoursOfOperation-200),TueMornPeak=1),$AN18,\nIF(AND($E18=\"Exterior\",$F18>=4200),$AN18*0.5,\n0))))","v":0},{"$f":"IF($AO18=0,0,\nIF($F18>8000,$AN18,\nIF(AND($F18>=(HoursOfOperation-200),TueEvePeak1=1),$AN18,\nIF(AND($E18=\"Exterior\",$F18>=4200),$AN18,\n0))))","v":0},{"$f":"IF($AO18=0,0,\nIF($F18>8000,$AN18,\nIF(AND($F18>=(HoursOfOperation-200),TueEvePeak2=1),$AN18,\nIF(AND($E18=\"Exterior\",$F18>=4200),$AN18,\n0))))","v":0},{"$f":"IF($AO18=0,0,\nIF($F18>8000,$AN18,\nIF(AND($F18>=(HoursOfOperation-200),WedMornPeak=1),$AN18,\nIF(AND($E18=\"Exterior\",$F18>=4200),$AN18*0.5,\n0))))","v":0},{"$f":"IF($AO18=0,0,\nIF($F18>8000,$AN18,\nIF(AND($F18>=(HoursOfOperation-200),WedEvePeak1=1),$AN18,\nIF(AND($E18=\"Exterior\",$F18>=4200),$AN18,\n0))))","v":0},{"$f":"IF($AO18=0,0,\nIF($F18>8000,$AN18,\nIF(AND($F18>=(HoursOfOperation-200),WedEvePeak2=1),$AN18,\nIF(AND($E18=\"Exterior\",$F18>=4200),$AN18,\n0))))","v":0},{"$f":"IF($AO18=0,0,\nIF($F18>8000,$AN18,\nIF(AND($F18>=(HoursOfOperation-200),ThurMornPeak=1),$AN18,\nIF(AND($E18=\"Exterior\",$F18>=4200),$AN18*0.5,\n0))))","v":0},{"$f":"IF($AO18=0,0,\nIF($F18>8000,$AN18,\nIF(AND($F18>=(HoursOfOperation-200),ThurEvePeak1=1),$AN18,\nIF(AND($E18=\"Exterior\",$F18>=4200),$AN18,\n0))))","v":0},{"$f":"IF($AO18=0,0,\nIF($F18>8000,$AN18,\nIF(AND($F18>=(HoursOfOperation-200),ThurEvePeak2=1),$AN18,\nIF(AND($E18=\"Exterior\",$F18>=4200),$AN18,\n0))))","v":0},{"$f":"IFERROR($F18*$R18,\"\")","v":0},{"$f":"IFERROR($F18*(1-SUM($AM18))*$AB18,\"\")","v":""},{"$f":"IFERROR($BB18-$BC18,\"\")","v":""},{"$f":"IFERROR(IF($E18=\"\",\"\",OFFSET(HVACadjustment,MATCH($E18,HeatSource,0),HVACAreaOffset,1,1)),0)","v":0},{"$f":"IFERROR(AN18*F18*BE18,0)","v":0},{"$f":"IFERROR(IF(BX18=\"C\",R18,AB18)*F18*AM18*BE18,0)","v":0},{"$f":"SUM(BF18:BG18)","v":0},{"$f":"IFERROR(VLOOKUP(CONCATENATE(VLOOKUP($L18,ExistingTypeLookup,2,0),\"(\",$O18,\")\"),BPAAdjustInputWatts,2,FALSE),\"\")","v":""},{"$f":"IFERROR($M18*$BI18,\"\")","v":""},{"$f":"IF(AND($BI18=\"\",$BJ18=\"\"),\"\",$G18*$BJ18*(1-$AH18)/1000)","v":""},{"$f":"IFERROR(IF($AB18=0,0,$R18-$BK18),0)","v":0},{"$f":"IFERROR($F18*$BL18*BE18,0)","v":0},{"$f":"IF(ISNUMBER(FIND(\"ER\",DB18)),$AN18,0)","v":0},{"$f":"IFERROR($F18*$BN18*BE18,0)","v":0},{"$f":"IFERROR(IF($AN18-$BN18=0,0,$AN18-$BL18),0)","v":0},{"$f":"IFERROR($F18*$BP18*BE18+BG18,0)","v":0},{"$f":"IFERROR($BH18-$BQ18,0)","v":0},{"$f":"IFERROR(VLOOKUP($L18,ExistingTypeLookup,4,FALSE),\"\")","v":""},{"$f":"IFERROR(VLOOKUP(BS18,RebateTypeDesc,2,FALSE),\"---\")","v":"---"},{"$f":"IFERROR(VLOOKUP($AG18,RetrofitTypeLookup,2,FALSE),\"\")","v":""},{"$f":"IFERROR(\nIF(AND($AI18=\"-\",$AJ18=\"-\"),\"\",\nIF(AND($BS18=\"N\",$BU18=\"L\"),VLOOKUP($AJ18,WattReductionTable,MATCH($BS18,WattReductionTitles,0),FALSE),\nIF(AND($BS18=\"L\",OR($BU18=\"L\",$BU18=\"LD\")),VLOOKUP($AJ18,WattReductionTable,MATCH(\"LL\",WattReductionTitles,0),FALSE),\nIF($BS18=\"S\",MAX(0,ROUND($AI18/10,0)),\nIF($BU18=\"L\",VLOOKUP(MIN($AI18,500),WattReductionTable,MATCH($BS18&$BU18,WattReductionTitles,0),FALSE),\nVLOOKUP(MIN($AI18,500),WattReductionTable,MATCH($BS18,WattReductionTitles,0),FALSE)))))),\n0)","v":""},{"$f":"IFERROR(\nIF($BS18=\"E\",\"\",\nIF(AND($F18<4000,$F18>0),\"T1\",\nIF(AND($F18>=4000,$F18<6000),\"T2\",\nIF($F18>=6000,\"T3\",\"\")))),\n\"\")","v":""},{"$f":"IFERROR(IF($BS18=\"E\",\"E\",VLOOKUP($V18,ProposedTypeLookup,4,FALSE)),\"\")","v":""},{"$f":"IFERROR(VLOOKUP(AK18,ExistingTypeLookupControls,3,FALSE),\"\")","v":""},{"$f":"IFERROR(\nIF($BS18=\"E\",\"\",\nIF($F18>=6000,\"T3\",\nIF($F18>=4000,\"T2\",\nIF($F18>=2000,\"T1\",\nIF($F18>0,\"T0\",\"\"))))),\n\"\")","v":""},{"$f":"IFERROR(\nIF($BX18=\"C\",VLOOKUP($Q18,WattReductionTable,MATCH(\"C\",WattReductionTitles,0),FALSE),\nVLOOKUP(ROUND($AA18,0),WattReductionTable,MATCH(\"C\",WattReductionTitles,0),FALSE)),\"\")","v":""},{"$f":"IFERROR(\nIF(OR($BX18=\"C\",$BX18=\"R\",$BX18=\"X\"),\"-\",\nIF(AND($BS18=\"E\",$BU18=\"F\",$BV18=\"S\"),\"ES\",\nIF(OR($BS18=\"\",$BU18=\"\",$BV18=\"\",$BW18=\"\"),\"-\",\nCONCATENATE($BS18,IF(BD18=\"E\",\"\",$BU18),$BV18,$BW18,$BX18)))),\n\"-\")","v":"-"},{"$f":"IFERROR(\nIF($BS18=\"S\",GetSpecialtyRate($BU18,$BW18,$BV18),\nOFFSET(INDIRECT(\"IncentiveRate\"&IncentiveRateActive),MATCH(CB18,RebateTable,0),0)),\n0)","v":0},{"$f":"IFERROR(\nIF(OR($DB18<>\"\",AND($BX18<>\"A\",$BX18<>\"E\"),CE18=0),\"\",\n   \"$\"&CE18/$DC18&\n   IF(AND($BS18<>\"E\",$BS18<>\"O\",OR($BU18=\"L\",$BU18=\"LD\")),\"/ea (Lamp)\",\"/ea (Fixt.)\")&\n   IF($AH18>0.1,\"*\",\"\")\n),\"\")","v":""},{"$f":"IFERROR(\nIF(DB18<>\"\",0,\nIF($V18=\"LED Components\",ROUND(CC18*ComponentPercent,0)*$DC18,\nROUND(CC18,0)*$DC18)),\n0)","v":0},{"$f":"IF(AND(CE18<>\"\",CE18<>0),CE18+IF(CV18>0,CW18,0),0)","v":0},{"$f":"IFERROR(IF(AND($BY18<>0,$BY18<>\"\",$CA18<>0,$CA18<>\"\"),$BY18&$CA18&$BZ18,\"-\"),\"-\")","v":"-"},{"$f":"IFERROR(ROUND(OFFSET(INDIRECT(\"ControlsRateFixture\"&IncentiveRateActive),MATCH($CG18,ControlsTable,0),0),0),\"\")","v":""},{"$f":"IFERROR(ROUND(OFFSET(INDIRECT(\"ControlsRateSensor\"&IncentiveRateActive),MATCH($CG18,ControlsTable,0),0),0),\"\")","v":""},{"$f":"IFERROR(IF($BX18=\"C\",$CH18*$G18,$CH18*$H18),0)","v":0},{"$f":"IFERROR(\nIF(OR($BY18=\"CN\",$BY18=\"CL\"),\n  IF($BX18=\"C\",$G18*$CI18,$H18*$CI18),\n$CI18*$AL18),0)","v":0},{"$f":"IFERROR(IF(DB18=\"\",\nIF(AND($CJ18<>\"\",$CK18<>\"\"),MIN($CJ18,$CK18),0),\n\"\"),0)","v":0},{"$f":"IF(AND(CL18<>\"\",CL18<>0),CL18+IF(CY18>0,CY18,0),0)","v":0},{"$f":"IFERROR(IF(OR($BX18<>\"R\",$DC18=0),\"-\",\"R\"&$BS18),\"-\")","v":"-"},{"$f":"IFERROR(IF(AND($DB18=\"\",$AN18<>\"\"),CONCATENATE(\"$\",VLOOKUP($CN18,RemovalTable,2,FALSE),\"/ea (Rem.)\"),\"\"),\"\")","v":""},{"$f":"IF($BX18=\"R\",DC18*VLOOKUP(CN18,RemovalTable,2,FALSE),0)","v":0},false,false,false,false,true,{"$f":"IFERROR(IF(AND($CQ18=TRUE,$CR18=TRUE,$CS18=TRUE,$CU18=TRUE,$DB18=\"\"),BonusSize,0),0)","v":0},{"$f":"IFERROR(IF($DB18=\"\",\nIF(CV18=0,0,\nIF(BonusCap=0,ROUND(CV18*CE18,0),\nIF(SUM(INDIRECT(\"CQ18:CQ\"&(D18+16)),INDIRECT(\"CS18:CS\"&(D18+16)),CV18*CE18)>=BonusCap,BonusCap-SUM(INDIRECT(\"CQ18:CQ\"&(D18+16)),INDIRECT(\"CS18:CS\"&(D18+16))),\nROUND(CV18*CE18,0)\n))),0),0)","v":0},{"$f":"IF(AND($CT18=TRUE,AND($BY18=\"CI\",$CR18=TRUE)),ControlsBonusRate,0)","v":0},{"$f":"IFERROR(IF(DB18=\"\",\nIF(CX18=0,0,\nIF(BonusCap=0,ROUND(CX18*CL18,0),\nIF(SUM(INDIRECT(\"CQ18:CQ\"&(D18+17)),INDIRECT(\"CS18:CS\"&(D18+16)))=BonusCap,0,\nIF(SUM(INDIRECT(\"CQ18:CQ\"&(D18+17)),INDIRECT(\"CS18:CS\"&(D18+16)),CX18*CL18)>BonusCap,BonusCap-SUM(INDIRECT(\"CQ18:CQ\"&(D18+17)),INDIRECT(\"CS18:CS\"&(D18+16))),\nROUND(CX18*CL18,0))))),0),0)","v":0},{"$f":"IFERROR(\nIF($DB18=\"\",\nIF($BX18=\"R\",$CP18,SUM(CE18,CL18)),0),0)","v":0},{"$f":"SUM(BF18*PDIrate_Base,\nBG18*SUM(PDIrate_Base,IF(AK18=\"Network\",PDIrate_Networked,0),IF(AK18=\"LLLC\",PDIrate_LLLC,0)))","v":0},{"$f":"InputErrorCheck(E18,F18,L18,BS18,M18,Q18,G18,V18,W18,AA18,H18,AD18,BV18,AK18,AL18)","v":""},{"$f":"IFERROR(IF(OR($BX18=\"C\",$BX18=\"X\"),\"-\",\nIF($BX18=\"R\",$G18,\nIF($G18<$H18,\nIF(AND($BS18<>\"H\",$BS18<>\"E\",$BS18<>\"O\",OR($BU18=\"L\",$BU18=\"LD\")),$W18*$G18,\n$G18),\nIF(AND($BS18<>\"H\",$BS18<>\"E\",$BS18<>\"O\",OR($BU18=\"L\",$BU18=\"LD\")),$X18,\n$H18)))),\"\")","v":0},{"$f":"IFERROR(IF($BX18=\"R\",$CN18,\nIF($BX18=\"C\",$CG18,\nIF($CB18=\"-\",\"\",$CB18)&IF($CG18=\"-\",\"\",CHAR(10)&$CG18))),\"\")","v":""},{"$f":"IFERROR(\nIF(OR($BX18=\"C\",$BX18=\"X\",AND($CB18=\"-\",OR($CO18=\"\",$CO18=0))),\"\",\nIF($BX18=\"R\",$CO18,$CD18)),\n\"\")","v":""},{"$f":"IFERROR(\nIF(OR(SUM($CJ18)=0,SUM($CK18=0)),\"\",\nIF(CJ18>CK18,\"$\"&CI18&\"/Sen\",\nIF(OR(BY18=\"CN\",BY18=\"CL\"),\n  IF(BX18=\"C\",\"$\"&ROUND(CL18/G18,1)&\"/Sen\",\"$\"&ROUND(CL18/H18,1)&\"/Sen\"),\n\"$\"&ROUND(CL18/AL18,1)&\"/Sen\"))),\"\")","v":""},{"$f":"CW18+CY18","v":0},{"$f":"CZ18","v":0},{"$f":"IF($DB18=\"\",CZ18+CW18+CY18,VLOOKUP(DB18,ErrorCheckingTable,3,FALSE))","v":0},{"$f":"IFERROR(IF(OR($CW18>0,$CY18>0),\"B\",\"\"),\"\")","v":""}]
[null,null,null,{"$f":"$D18+1","v":2},0,0,0,{"$f":"IF(OR($BX19=\"C\",$BX19=\"X\"),G19,\nHLOOKUP(\"# of Fixtures\",InputTable,MATCH($D19,InputLineNumbers,0)+2,FALSE))","v":0},0,"---",0,0,0,{"$f":"G19*M19","v":0},0,0,0,{"$f":"IFERROR(($G19*$Q19*(1-MAX(0,$AH19-0.1)))/1000,\"\")","v":0},"","---",0,0,0,{"$f":"W19*H19","v":0},0,0,{"$f":"HLOOKUP(\"Watts / Fixture\",InputTable,MATCH($D19,InputLineNumbers,0)+2,FALSE)","v":""},{"$f":"IFERROR(\nIF($BX19=\"R\",0,\nIF(OR($BX19=\"X\",$BX19=\"C\"),$R19,\n$H19*$AA19/1000)),\n\"\")","v":""},"",0,"","",{"$f":"IFERROR(\nIF(OR(V19=\"**Fixture Removal Only**\",V19=\"**Lighting Controls Only**\",V19=\"**Existing to Remain**\"),\"-\",\nVLOOKUP(V19,ProposedTypeLookup,3,FALSE)),\n\"-\")","v":"-"},null,{"$f":"IFERROR(ROUND(IF($G19<$H19,($AN19*1000)/$G19,($AN19*1000)/$H19),0),\"-\")","v":"-"},{"$f":"IFERROR(IF(AND($BS19=\"L\",AND($L19=\"Linear (Other)\",$BU19=\"L\")),ROUND($AI19/$W19,0),\nIF(OR(AND($BS19=\"L\",$BU19=\"L\"),AND($BS19=\"L\",$BU19=\"LD\")),ROUND($AI19/$W19,0),\nIF(AND($BS19=\"4'T12-L\",OR($BU19=\"L\",$BU19=\"LD\")),ROUND($AI19/$W19,0),\nIF(AND($BS19=\"N\",$BU19=\"L\"),ROUND($AI19/$W19,0),\"-\")))),\"\")","v":"-"},"-","-",{"$f":"IFERROR(IF(VLOOKUP(AK19,ExistingTypeLookupControls,2,FALSE)=\"\",\"-\",VLOOKUP(AK19,ExistingTypeLookupControls,2,FALSE)),\"-\")","v":"-"},{"$f":"IFERROR(IF($BX19=\"R\",$R19,IF($AB19=0,0,$R19-$AB19)),0)","v":0},0,0,0,0,0,0,0,0,0,0,0,0,0,{"$f":"IFERROR($F19*$R19,\"\")","v":0},{"$f":"IFERROR($F19*(1-SUM($AM19))*$AB19,\"\")","v":""},{"$f":"IFERROR($BB19-$BC19,\"\")","v":""},{"$f":"IFERROR(IF($E19=\"\",\"\",OFFSET(HVACadjustment,MATCH($E19,HeatSource,0),HVACAreaOffset,1,1)),0)","v":0},{"$f":"IFERROR(AN19*F19*BE19,0)","v":0},{"$f":"IFERROR(IF(BX19=\"C\",R19,AB19)*F19*AM19*BE19,0)","v":0},{"$f":"SUM(BF19:BG19)","v":0},"","",{"$f":"IF(AND($BI19=\"\",$BJ19=\"\"),\"\",$G19*$BJ19*(1-$AH19)/1000)","v":""},{"$f":"IFERROR(IF($AB19=0,0,$R19-$BK19),0)","v":0},{"$f":"IFERROR($F19*$BL19*BE19,0)","v":0},{"$f":"IF(ISNUMBER(FIND(\"ER\",DB19)),$AN19,0)","v":0},{"$f":"IFERROR($F19*$BN19*BE19,0)","v":0},{"$f":"IFERROR(IF($AN19-$BN19=0,0,$AN19-$BL19),0)","v":0},{"$f":"IFERROR($F19*$BP19*BE19+BG19,0)","v":0},0,{"$f":"IFERROR(VLOOKUP($L19,ExistingTypeLookup,4,FALSE),\"\")","v":""},{"$f":"IFERROR(VLOOKUP(BS19,RebateTypeDesc,2,FALSE),\"---\")","v":"---"},"",{"$f":"IFERROR(\nIF(AND($AI19=\"-\",$AJ19=\"-\"),\"\",\nIF(AND($BS19=\"N\",$BU19=\"L\"),VLOOKUP($AJ19,WattReductionTable,MATCH($BS19,WattReductionTitles,0),FALSE),\nIF(AND($BS19=\"L\",OR($BU19=\"L\",$BU19=\"LD\")),VLOOKUP($AJ19,WattReductionTable,MATCH(\"LL\",WattReductionTitles,0),FALSE),\nIF($BS19=\"S\",MAX(0,ROUND($AI19/10,0)),\nIF($BU19=\"L\",VLOOKUP(MIN($AI19,500),WattReductionTable,MATCH($BS19&$BU19,WattReductionTitles,0),FALSE),\nVLOOKUP(MIN($AI19,500),WattReductionTable,MATCH($BS19,WattReductionTitles,0),FALSE)))))),\n0)","v":""},{"$f":"IFERROR(\nIF($BS19=\"E\",\"\",IF(AND($F19<4000,$F19>0),\"T1\",\nIF(AND($F19>=4000,$F19<6000),\"T2\",\nIF($F19>=6000,\"T3\",\"\")))),\n\"\")","v":""},"",{"$f":"IFERROR(VLOOKUP(AK19,ExistingTypeLookupControls,3,FALSE),\"\")","v":""},{"$f":"IFERROR(\nIF($BS19=\"E\",\"\",\nIF($F19>=6000,\"T3\",\nIF($F19>=4000,\"T2\",\nIF($F19>=2000,\"T1\",\nIF($F19>0,\"T0\",\"\"))))),\n\"\")","v":""},"",{"$f":"IFERROR(\nIF(OR($BX19=\"C\",$BX19=\"R\",$BX19=\"X\"),\"-\",\nIF(AND($BS19=\"E\",$BU19=\"F\",$BV19=\"S\"),\"ES\",\nIF(OR($BS19=\"\",$BU19=\"\",$BV19=\"\",$BW19=\"\"),\"-\",\nCONCATENATE($BS19,IF(BD19=\"E\",\"\",$BU19),$BV19,$BW19,$BX19)))),\n\"-\")","v":"-"},{"$f":"IFERROR(\nIF($BS19=\"S\",GetSpecialtyRate($BU19,$BW19,$BV19),\nOFFSET(INDIRECT(\"IncentiveRate\"&IncentiveRateActive),MATCH(CB19,RebateTable,0),0)),\n0)","v":0},{"$f":"IFERROR(\nIF(OR($DB19<>\"\",AND($BX19<>\"A\",$BX19<>\"E\"),CE19=0),\"\",\n   \"$\"&CE19/$DC19&\n   IF(AND($BS19<>\"E\",$BS19<>\"O\",OR($BU19=\"L\",$BU19=\"LD\")),\"/ea (Lamp)\",\"/ea (Fixt.)\")&\n   IF($AH19>0.1,\"*\",\"\")\n),\"\")","v":""},{"$f":"IFERROR(\nIF(DB19<>\"\",0,\nIF($V19=\"LED Components\",ROUND(CC19*ComponentPercent,0)*$DC19,\nROUND(CC19,0)*$DC19)),\n0)","v":0},{"$f":"IF(AND(CE19<>\"\",CE19<>0),CE19+IF(CV19>0,CW19,0),0)","v":0},{"$f":"IFERROR(IF(AND($BY19<>0,$BY19<>\"\",$CA19<>0,$CA19<>\"\"),$BY19&$CA19&$BZ19,\"-\"),\"-\")","v":"-"},{"$f":"IFERROR(ROUND(OFFSET(INDIRECT(\"ControlsRateFixture\"&IncentiveRateActive),MATCH($CG19,ControlsTable,0),0),0),\"\")","v":""},{"$f":"IFERROR(ROUND(OFFSET(INDIRECT(\"ControlsRateSensor\"&IncentiveRateActive),MATCH($CG19,ControlsTable,0),0),0),\"\")","v":""},{"$f":"IFERROR(IF($BX19=\"C\",$CH19*$G19,$CH19*$H19),0)","v":0},{"$f":"IFERROR(\nIF(OR($BY19=\"CN\",$BY19=\"CL\"),\n  IF($BX19=\"C\",$G19*$CI19,$H19*$CI19),\n$CI19*$AL19),0)","v":0},{"$f":"IFERROR(IF(DB19=\"\",\nIF(AND($CJ19<>\"\",$CK19<>\"\"),MIN($CJ19,$CK19),0),\n\"\"),0)","v":0},{"$f":"IF(AND(CL19<>\"\",CL19<>0),CL19+IF(CY19>0,CY19,0),0)","v":0},{"$f":"IFERROR(IF(OR($BX19<>\"R\",$DC19=0),\"-\",\"R\"&$BS19),\"-\")","v":"-"},"",{"$f":"IF($BX19=\"R\",DC19*VLOOKUP(CN19,RemovalTable,2,FALSE),0)","v":0},false,false,false,false,true,{"$f":"IFERROR(IF(AND($CQ19=TRUE,$CR19=TRUE,$CS19=TRUE,$CU19=TRUE,$DB19=\"\"),BonusSize,0),0)","v":0},{"$f":"IFERROR(IF($DB19=\"\",\nIF(CV19=0,0,\nIF(BonusCap=0,ROUND(CV19*CE19,0),\nIF(SUM(INDIRECT(\"CQ18:CQ\"&(D19+16)),INDIRECT(\"CS18:CS\"&(D19+16)),CV19*CE19)>=BonusCap,BonusCap-SUM(INDIRECT(\"CQ18:CQ\"&(D19+16)),INDIRECT(\"CS18:CS\"&(D19+16))),\nROUND(CV19*CE19,0)\n))),0),0)","v":0},0,{"$f":"IFERROR(IF(DB19=\"\",\nIF(CX19=0,0,\nIF(BonusCap=0,ROUND(CX19*CL19,0),\nIF(SUM(INDIRECT(\"CQ18:CQ\"&(D19+17)),INDIRECT(\"CS18:CS\"&(D19+16)))=BonusCap,0,\nIF(SUM(INDIRECT(\"CQ18:CQ\"&(D19+17)),INDIRECT(\"CS18:CS\"&(D19+16)),CX19*CL19)>BonusCap,BonusCap-SUM(INDIRECT(\"CQ18:CQ\"&(D19+17)),INDIRECT(\"CS18:CS\"&(D19+16))),\nROUND(CX19*CL19,0))))),0),0)","v":0},{"$f":"IFERROR(\nIF($DB19=\"\",\nIF($BX19=\"R\",$CP19,SUM(CE19,CL19)),0),0)","v":0},0,{"$f":"InputErrorCheck(E19,F19,L19,BS19,M19,Q19,G19,V19,W19,AA19,H19,AD19,BV19,AK19,AL19)","v":""},{"$f":"IFERROR(IF(OR($BX19=\"C\",$BX19=\"X\"),\"-\",\nIF($BX19=\"R\",$G19,\nIF($G19<$H19,\nIF(AND($BS19<>\"H\",$BS19<>\"E\",$BS19<>\"O\",OR($BU19=\"L\",$BU19=\"LD\")),$W19*$G19,\n$G19),\nIF(AND($BS19<>\"H\",$BS19<>\"E\",$BS19<>\"O\",OR($BU19=\"L\",$BU19=\"LD\")),$X19,\n$H19)))),\"\")","v":0},"","",{"$f":"IFERROR(\nIF(OR(SUM($CJ19)=0,SUM($CK19=0)),\"\",\nIF(CJ19>CK19,\"$\"&CI19&\"/Sen\",\nIF(OR(BY19=\"CN\",BY19=\"CL\"),\n  IF(BX19=\"C\",\"$\"&ROUND(CL19/G19,1)&\"/Sen\",\"$\"&ROUND(CL19/H19,1)&\"/Sen\"),\n\"$\"&ROUND(CL19/AL19,1)&\"/Sen\"))),\"\")","v":""},{"$f":"CW19+CY19","v":0},{"$f":"CZ19","v":0},{"$f":"IF($DB19=\"\",CZ19+CW19+CY19,VLOOKUP(DB19,ErrorCheckingTable,3,FALSE))","v":0},""]
[null,null,null,3,0,0,0,{"$f":"IF(OR($BX20=\"C\",$BX20=\"X\"),G20,\nHLOOKUP(\"# of Fixtures\",InputTable,MATCH($D20,InputLineNumbers,0)+2,FALSE))","v":0},0,"---",0,0,0,{"$f":"G20*M20","v":0},0,0,0,{"$f":"IFERROR(($G20*$Q20*(1-MAX(0,$AH20-0.1)))/1000,\"\")","v":0},"","---",0,0,0,{"$f":"W20*H20","v":0},0,0,"","","",0,"","",{"$f":"IFERROR(\nIF(OR(V20=\"**Fixture Removal Only**\",V20=\"**Lighting Controls Only**\",V20=\"**Existing to Remain**\"),\"-\",\nVLOOKUP(V20,ProposedTypeLookup,3,FALSE)),\n\"-\")","v":"-"},null,{"$f":"IFERROR(ROUND(IF($G20<$H20,($AN20*1000)/$G20,($AN20*1000)/$H20),0),\"-\")","v":"-"},{"$f":"IFERROR(IF(AND($BS20=\"L\",AND($L20=\"Linear (Other)\",$BU20=\"L\")),ROUND($AI20/$W20,0),\nIF(OR(AND($BS20=\"L\",$BU20=\"L\"),AND($BS20=\"L\",$BU20=\"LD\")),ROUND($AI20/$W20,0),\nIF(AND($BS20=\"4'T12-L\",OR($BU20=\"L\",$BU20=\"LD\")),ROUND($AI20/$W20,0),\nIF(AND($BS20=\"N\",$BU20=\"L\"),ROUND($AI20/$W20,0),\"-\")))),\"\")","v":"-"},"-","-",{"$f":"IFERROR(IF(VLOOKUP(AK20,ExistingTypeLookupControls,2,FALSE)=\"\",\"-\",VLOOKUP(AK20,ExistingTypeLookupControls,2,FALSE)),\"-\")","v":"-"},{"$f":"IFERROR(IF($BX20=\"R\",$R20,IF($AB20=0,0,$R20-$AB20)),0)","v":0},0,0,0,0,0,0,0,0,0,0,0,0,0,0,"","",{"$f":"IFERROR(IF($E20=\"\",\"\",OFFSET(HVACadjustment,MATCH($E20,HeatSource,0),HVACAreaOffset,1,1)),0)","v":0},{"$f":"IFERROR(AN20*F20*BE20,0)","v":0},{"$f":"IFERROR(IF(BX20=\"C\",R20,AB20)*F20*AM20*BE20,0)","v":0},{"$f":"SUM(BF20:BG20)","v":0},"","",{"$f":"IF(AND($BI20=\"\",$BJ20=\"\"),\"\",$G20*$BJ20*(1-$AH20)/1000)","v":""},{"$f":"IFERROR(IF($AB20=0,0,$R20-$BK20),0)","v":0},{"$f":"IFERROR($F20*$BL20*BE20,0)","v":0},{"$f":"IF(ISNUMBER(FIND(\"ER\",DB20)),$AN20,0)","v":0},{"$f":"IFERROR($F20*$BN20*BE20,0)","v":0},{"$f":"IFERROR(IF($AN20-$BN20=0,0,$AN20-$BL20),0)","v":0},{"$f":"IFERROR($F20*$BP20*BE20+BG20,0)","v":0},0,{"$f":"IFERROR(VLOOKUP($L20,ExistingTypeLookup,4,FALSE),\"\")","v":""},{"$f":"IFERROR(VLOOKUP(BS20,RebateTypeDesc,2,FALSE),\"---\")","v":"---"},"",{"$f":"IFERROR(\nIF(AND($AI20=\"-\",$AJ20=\"-\"),\"\",\nIF(AND($BS20=\"N\",$BU20=\"L\"),VLOOKUP($AJ20,WattReductionTable,MATCH($BS20,WattReductionTitles,0),FALSE),\nIF(AND($BS20=\"L\",OR($BU20=\"L\",$BU20=\"LD\")),VLOOKUP($AJ20,WattReductionTable,MATCH(\"LL\",WattReductionTitles,0),FALSE),\nIF($BS20=\"S\",ROUND($AI20/10,0),\nIF($BU20=\"L\",VLOOKUP(MIN($AI20,500),WattReductionTable,MATCH($BS20&$BU20,WattReductionTitles,0),FALSE),\nVLOOKUP(MIN($AI20,500),WattReductionTable,MATCH($BS20,WattReductionTitles,0),FALSE)))))),\n0)","v":""},{"$f":"IFERROR(\nIF($BS20=\"E\",\"\",IF(AND($F20<4000,$F20>0),\"T1\",\nIF(AND($F20>=4000,$F20<6000),\"T2\",\nIF($F20>=6000,\"T3\",\"\")))),\n\"\")","v":""},"",{"$f":"IFERROR(VLOOKUP(AK20,ExistingTypeLookupControls,3,FALSE),\"\")","v":""},"","",{"$f":"IFERROR(\nIF(OR($BX20=\"C\",$BX20=\"R\",$BX20=\"X\"),\"-\",\nIF(AND($BS20=\"E\",$BU20=\"F\",$BV20=\"S\"),\"ES\",\nIF(OR($BS20=\"\",$BU20=\"\",$BV20=\"\",$BW20=\"\"),\"-\",\nCONCATENATE($BS20,IF(BD20=\"E\",\"\",$BU20),$BV20,$BW20,$BX20)))),\n\"-\")","v":"-"},{"$f":"IFERROR(\nIF($BS20=\"S\",GetSpecialtyRate($BU20,$BW20,$BV20),\nOFFSET(INDIRECT(\"IncentiveRate\"&IncentiveRateActive),MATCH(CB20,RebateTable,0),0)),\n0)","v":0},{"$f":"IFERROR(\nIF(OR($DB20<>\"\",AND($BX20<>\"A\",$BX20<>\"E\"),CE20=0),\"\",\n   \"$\"&CE20/$DC20&\n   IF(AND($BS20<>\"E\",$BS20<>\"O\",OR($BU20=\"L\",$BU20=\"LD\")),\"/ea (Lamp)\",\"/ea (Fixt.)\")&\n   IF($AH20>0.1,\"*\",\"\")\n),\"\")","v":""},{"$f":"IFERROR(\nIF(DB20<>\"\",0,\nIF($V20=\"LED Components\",ROUND(CC20*ComponentPercent,0)*$DC20,\nROUND(CC20,0)*$DC20)),\n0)","v":0},{"$f":"IF(AND(CE20<>\"\",CE20<>0),CE20+IF(CV20>0,CW20,0),0)","v":0},"-",{"$f":"IFERROR(ROUND(OFFSET(INDIRECT(\"ControlsRateFixture\"&IncentiveRateActive),MATCH($CG20,ControlsTable,0),0),0),\"\")","v":""},{"$f":"IFERROR(ROUND(OFFSET(INDIRECT(\"ControlsRateSensor\"&IncentiveRateActive),MATCH($CG20,ControlsTable,0),0),0),\"\")","v":""},{"$f":"IFERROR(IF($BX20=\"C\",$CH20*$G20,$CH20*$H20),0)","v":0},{"$f":"IFERROR(\nIF(OR($BY20=\"CN\",$BY20=\"CL\"),\n  IF($BX20=\"C\",$G20*$CI20,$H20*$CI20),\n$CI20*$AL20),0)","v":0},{"$f":"IFERROR(IF(DB20=\"\",\nIF(AND($CJ20<>\"\",$CK20<>\"\"),MIN($CJ20,$CK20),0),\n\"\"),0)","v":0},{"$f":"IF(AND(CL20<>\"\",CL20<>0),CL20+IF(CY20>0,CY20,0),0)","v":0},{"$f":"IFERROR(IF(OR($BX20<>\"R\",$DC20=0),\"-\",\"R\"&$BS20),\"-\")","v":"-"},"",{"$f":"IFERROR(IF($BX20=\"R\",DC20*VLOOKUP(CN20,RemovalTable,2,FALSE),0),0)","v":0},false,false,false,false,true,{"$f":"IFERROR(IF(AND($CQ20=TRUE,$CR20=TRUE,$CS20=TRUE,$CU20=TRUE,$DB20=\"\"),BonusSize,0),0)","v":0},{"$f":"IFERROR(IF($DB20=\"\",\nIF(CV20=0,0,\nIF(BonusCap=0,ROUND(CV20*CE20,0),\nMIN(BonusCap,ROUND(CV20*CE20,0))\n)),0),0)","v":0},0,{"$f":"IFERROR(IF(DB20=\"\",\nIF(CX20=0,0,\nIF(BonusCap=0,ROUND(CX20*CL20,0),\nIF(CW20=BonusCap,0,\nIF((CW20+CX20*CL20)>BonusCap,BonusCap-CW20,\nROUND(CX20*CL20,0))))),0),0)","v":0},{"$f":"IFERROR(\nIF($DB20=\"\",\nIF($BX20=\"R\",$CP20,SUM(CE20,CL20)),0),0)","v":0},0,{"$f":"InputErrorCheck(E20,F20,L20,BS20,M20,Q20,G20,V20,W20,AA20,H20,AD20,BV20,AK20,AL20)","v":""},{"$f":"IFERROR(IF(OR($BX20=\"C\",$BX20=\"X\"),\"-\",\nIF($BX20=\"R\",$G20,\nIF($G20<$H20,\nIF(AND($BS20<>\"H\",$BS20<>\"E\",$BS20<>\"O\",OR($BU20=\"L\",$BU20=\"LD\")),$W20*$G20,\n$G20),\nIF(AND($BS20<>\"H\",$BS20<>\"E\",$BS20<>\"O\",OR($BU20=\"L\",$BU20=\"LD\")),$X20,\n$H20)))),\"\")","v":0},"","",{"$f":"IFERROR(\nIF(OR(SUM($CJ20)=0,SUM($CK20=0)),\"\",\nIF(CJ20>CK20,\"$\"&CI20&\"/Sen\",\nIF(OR(BY20=\"CN\",BY20=\"CL\"),\n  IF(BX20=\"C\",\"$\"&ROUND(CL20/G20,1)&\"/Sen\",\"$\"&ROUND(CL20/H20,1)&\"/Sen\"),\n\"$\"&ROUND(CL20/AL20,1)&\"/Sen\"))),\"\")","v":""},{"$f":"CW20+CY20","v":0},{"$f":"CZ20","v":0},{"$f":"IF($DB20=\"\",CZ20+CW20+CY20,VLOOKUP(DB20,ErrorCheckingTable,3,FALSE))","v":0}]
[null,null,null,4,0,0,0,{"$f":"IF(OR($BX21=\"C\",$BX21=\"X\"),G21,\nHLOOKUP(\"# of Fixtures\",InputTable,MATCH($D21,InputLineNumbers,0)+2,FALSE))","v":0},0,"---",{"$f":"HLOOKUP(\"Fixture Type\",InputTable,MATCH($D21,InputLineNumbers,0)+1,FALSE)","v":0},0,0,{"$f":"G21*M21","v":0},0,0,0,{"$f":"IFERROR(($G21*$Q21*(1-MAX(0,$AH21-0.1)))/1000,\"\")","v":0},"","---",0,0,0,{"$f":"W21*H21","v":0},0,0,"","","",0,"","",{"$f":"IFERROR(\nIF(OR(V21=\"**Fixture Removal Only**\",V21=\"**Lighting Controls Only**\",V21=\"**Existing to Remain**\"),\"-\",\nVLOOKUP(V21,ProposedTypeLookup,3,FALSE)),\n\"-\")","v":"-"},null,{"$f":"IFERROR(ROUND(IF($G21<$H21,($AN21*1000)/$G21,($AN21*1000)/$H21),0),\"-\")","v":"-"},"-","-","-",{"$f":"IFERROR(IF(VLOOKUP(AK21,ExistingTypeLookupControls,2,FALSE)=\"\",\"-\",VLOOKUP(AK21,ExistingTypeLookupControls,2,FALSE)),\"-\")","v":"-"},{"$f":"IFERROR(IF($BX21=\"R\",$R21,IF($AB21=0,0,$R21-$AB21)),0)","v":0},0,0,0,0,0,0,0,0,0,0,0,0,0,0,"","",{"$f":"IFERROR(IF($E21=\"\",\"\",OFFSET(HVACadjustment,MATCH($E21,HeatSource,0),HVACAreaOffset,1,1)),0)","v":0},{"$f":"IFERROR(AN21*F21*BE21,0)","v":0},{"$f":"IFERROR(IF(BX21=\"C\",R21,AB21)*F21*AM21*BE21,0)","v":0},{"$f":"SUM(BF21:BG21)","v":0},"","",{"$f":"IF(AND($BI21=\"\",$BJ21=\"\"),\"\",$G21*$BJ21*(1-$AH21)/1000)","v":""},{"$f":"IFERROR(IF($AB21=0,0,$R21-$BK21),0)","v":0},{"$f":"IFERROR($F21*$BL21*BE21,0)","v":0},{"$f":"IF(ISNUMBER(FIND(\"ER\",DB21)),$AN21,0)","v":0},{"$f":"IFERROR($F21*$BN21*BE21,0)","v":0},{"$f":"IFERROR(IF($AN21-$BN21=0,0,$AN21-$BL21),0)","v":0},{"$f":"IFERROR($F21*$BP21*BE21+BG21,0)","v":0},0,"",{"$f":"IFERROR(VLOOKUP(BS21,RebateTypeDesc,2,FALSE),\"---\")","v":"---"},"","",{"$f":"IFERROR(\nIF($BS21=\"E\",\"\",IF(AND($F21<4000,$F21>0),\"T1\",\nIF(AND($F21>=4000,$F21<6000),\"T2\",\nIF($F21>=6000,\"T3\",\"\")))),\n\"\")","v":""},"",{"$f":"IFERROR(VLOOKUP(AK21,ExistingTypeLookupControls,3,FALSE),\"\")","v":""},"","",{"$f":"IFERROR(\nIF(OR($BX21=\"C\",$BX21=\"R\",$BX21=\"X\"),\"-\",\nIF(AND($BS21=\"E\",$BU21=\"F\",$BV21=\"S\"),\"ES\",\nIF(OR($BS21=\"\",$BU21=\"\",$BV21=\"\",$BW21=\"\"),\"-\",\nCONCATENATE($BS21,IF(BD21=\"E\",\"\",$BU21),$BV21,$BW21,$BX21)))),\n\"-\")","v":"-"},{"$f":"IFERROR(\nIF($BS21=\"S\",GetSpecialtyRate($BU21,$BW21,$BV21),\nOFFSET(INDIRECT(\"IncentiveRate\"&IncentiveRateActive),MATCH(CB21,RebateTable,0),0)),\n0)","v":0},{"$f":"IFERROR(\nIF(OR($DB21<>\"\",AND($BX21<>\"A\",$BX21<>\"E\"),CE21=0),\"\",\n   \"$\"&CE21/$DC21&\n   IF(AND($BS21<>\"E\",$BS21<>\"O\",OR($BU21=\"L\",$BU21=\"LD\")),\"/ea (Lamp)\",\"/ea (Fixt.)\")&\n   IF($AH21>0.1,\"*\",\"\")\n),\"\")","v":""},{"$f":"IFERROR(\nIF(DB21<>\"\",0,\nIF($V21=\"LED Components\",ROUND(CC21*ComponentPercent,0)*$DC21,\nROUND(CC21,0)*$DC21)),\n0)","v":0},{"$f":"IF(AND(CE21<>\"\",CE21<>0),CE21+IF(CV21>0,CW21,0),0)","v":0},"-",{"$f":"IFERROR(ROUND(OFFSET(INDIRECT(\"ControlsRateFixture\"&IncentiveRateActive),MATCH($CG21,ControlsTable,0),0),0),\"\")","v":""},{"$f":"IFERROR(ROUND(OFFSET(INDIRECT(\"ControlsRateSensor\"&IncentiveRateActive),MATCH($CG21,ControlsTable,0),0),0),\"\")","v":""},{"$f":"IFERROR(IF($BX21=\"C\",$CH21*$G21,$CH21*$H21),0)","v":0},{"$f":"IFERROR(\nIF(OR($BY21=\"CN\",$BY21=\"CL\"),\n  IF($BX21=\"C\",$G21*$CI21,$H21*$CI21),\n$CI21*$AL21),0)","v":0},{"$f":"IFERROR(IF(DB21=\"\",\nIF(AND($CJ21<>\"\",$CK21<>\"\"),MIN($CJ21,$CK21),0),\n\"\"),0)","v":0},{"$f":"IF(AND(CL21<>\"\",CL21<>0),CL21+IF(CY21>0,CY21,0),0)","v":0},"-","",{"$f":"IFERROR(IF($BX21=\"R\",DC21*VLOOKUP(CN21,RemovalTable,2,FALSE),0),0)","v":0},false,false,false,false,true,0,{"$f":"IFERROR(IF($DB21=\"\",\nIF(CV21=0,0,\nIF(BonusCap=0,ROUND(CV21*CE21,0),\nMIN(BonusCap,ROUND(CV21*CE21,0))\n)),0),0)","v":0},0,{"$f":"IFERROR(IF(DB21=\"\",\nIF(CX21=0,0,\nIF(BonusCap=0,ROUND(CX21*CL21,0),\nIF(CW21=BonusCap,0,\nIF((CW21+CX21*CL21)>BonusCap,BonusCap-CW21,\nROUND(CX21*CL21,0))))),0),0)","v":0},{"$f":"IFERROR(\nIF($DB21=\"\",\nIF($BX21=\"R\",$CP21,SUM(CE21,CL21)),0),0)","v":0},0,{"$f":"InputErrorCheck(E21,F21,L21,BS21,M21,Q21,G21,V21,W21,AA21,H21,AD21,BV21,AK21,AL21)","v":""},{"$f":"IFERROR(IF(OR($BX21=\"C\",$BX21=\"X\"),\"-\",\nIF($BX21=\"R\",$G21,\nIF($G21<$H21,\nIF(AND($BS21<>\"H\",$BS21<>\"E\",$BS21<>\"O\",OR($BU21=\"L\",$BU21=\"LD\")),$W21*$G21,\n$G21),\nIF(AND($BS21<>\"H\",$BS21<>\"E\",$BS21<>\"O\",OR($BU21=\"L\",$BU21=\"LD\")),$X21,\n$H21)))),\"\")","v":0},"","",{"$f":"IFERROR(\nIF(OR(SUM($CJ21)=0,SUM($CK21=0)),\"\",\nIF(CJ21>CK21,\"$\"&CI21&\"/Sen\",\nIF(OR(BY21=\"CN\",BY21=\"CL\"),\n  IF(BX21=\"C\",\"$\"&ROUND(CL21/G21,1)&\"/Sen\",\"$\"&ROUND(CL21/H21,1)&\"/Sen\"),\n\"$\"&ROUND(CL21/AL21,1)&\"/Sen\"))),\"\")","v":""},{"$f":"CW21+CY21","v":0},{"$f":"CZ21","v":0},{"$f":"IF($DB21=\"\",CZ21+CW21+CY21,VLOOKUP(DB21,ErrorCheckingTable,3,FALSE))","v":0}]
[null,null,null,5,0,0,0,0,0,"---",{"$f":"HLOOKUP(\"Fixture Type\",InputTable,MATCH($D22,InputLineNumbers,0)+1,FALSE)","v":0},0,0,{"$f":"G22*M22","v":0},0,0,0,{"$f":"IFERROR(($G22*$Q22*(1-MAX(0,$AH22-0.1)))/1000,\"\")","v":0},"","---",0,0,0,{"$f":"W22*H22","v":0},0,0,"","","",0,"","",{"$f":"IFERROR(\nIF(OR(V22=\"**Fixture Removal Only**\",V22=\"**Lighting Controls Only**\",V22=\"**Existing to Remain**\"),\"-\",\nVLOOKUP(V22,ProposedTypeLookup,3,FALSE)),\n\"-\")","v":"-"},null,{"$f":"IFERROR(ROUND(IF($G22<$H22,($AN22*1000)/$G22,($AN22*1000)/$H22),0),\"-\")","v":"-"},"-","-","-",{"$f":"IFERROR(IF(VLOOKUP(AK22,ExistingTypeLookupControls,2,FALSE)=\"\",\"-\",VLOOKUP(AK22,ExistingTypeLookupControls,2,FALSE)),\"-\")","v":"-"},{"$f":"IFERROR(IF($BX22=\"R\",$R22,IF($AB22=0,0,$R22-$AB22)),0)","v":0},0,0,0,0,0,0,0,0,0,0,0,0,0,0,"","",{"$f":"IFERROR(IF($E22=\"\",\"\",OFFSET(HVACadjustment,MATCH($E22,HeatSource,0),HVACAreaOffset,1,1)),0)","v":0},{"$f":"IFERROR(AN22*F22*BE22,0)","v":0},{"$f":"IFERROR(IF(BX22=\"C\",R22,AB22)*F22*AM22*BE22,0)","v":0},{"$f":"SUM(BF22:BG22)","v":0},"","",{"$f":"IF(AND($BI22=\"\",$BJ22=\"\"),\"\",$G22*$BJ22*(1-$AH22)/1000)","v":""},{"$f":"IFERROR(IF($AB22=0,0,$R22-$BK22),0)","v":0},{"$f":"IFERROR($F22*$BL22*BE22,0)","v":0},{"$f":"IF(ISNUMBER(FIND(\"ER\",DB22)),$AN22,0)","v":0},{"$f":"IFERROR($F22*$BN22*BE22,0)","v":0},{"$f":"IFERROR(IF($AN22-$BN22=0,0,$AN22-$BL22),0)","v":0},{"$f":"IFERROR($F22*$BP22*BE22+BG22,0)","v":0},0,"",{"$f":"IFERROR(VLOOKUP(BS22,RebateTypeDesc,2,FALSE),\"---\")","v":"---"},"","",{"$f":"IFERROR(\nIF($BS22=\"E\",\"\",IF(AND($F22<4000,$F22>0),\"T1\",\nIF(AND($F22>=4000,$F22<6000),\"T2\",\nIF($F22>=6000,\"T3\",\"\")))),\n\"\")","v":""},"","","","",{"$f":"IFERROR(\nIF(OR($BX22=\"C\",$BX22=\"R\",$BX22=\"X\"),\"-\",\nIF(AND($BS22=\"E\",$BU22=\"F\",$BV22=\"S\"),\"ES\",\nIF(OR($BS22=\"\",$BU22=\"\",$BV22=\"\",$BW22=\"\"),\"-\",\nCONCATENATE($BS22,IF(BD22=\"E\",\"\",$BU22),$BV22,$BW22,$BX22)))),\n\"-\")","v":"-"},{"$f":"IFERROR(\nIF($BS22=\"S\",GetSpecialtyRate($BU22,$BW22,$BV22),\nOFFSET(INDIRECT(\"IncentiveRate\"&IncentiveRateActive),MATCH(CB22,RebateTable,0),0)),\n0)","v":0},{"$f":"IFERROR(\nIF(OR($DB22<>\"\",AND($BX22<>\"A\",$BX22<>\"E\"),CE22=0),\"\",\n   \"$\"&CE22/$DC22&\n   IF(AND($BS22<>\"E\",$BS22<>\"O\",OR($BU22=\"L\",$BU22=\"LD\")),\"/ea (Lamp)\",\"/ea (Fixt.)\")&\n   IF($AH22>0.1,\"*\",\"\")\n),\"\")","v":""},0,{"$f":"IF(AND(CE22<>\"\",CE22<>0),CE22+IF(CV22>0,CW22,0),0)","v":0},"-",{"$f":"IFERROR(ROUND(OFFSET(INDIRECT(\"ControlsRateFixture\"&IncentiveRateActive),MATCH($CG22,ControlsTable,0),0),0),\"\")","v":""},{"$f":"IFERROR(ROUND(OFFSET(INDIRECT(\"ControlsRateSensor\"&IncentiveRateActive),MATCH($CG22,ControlsTable,0),0),0),\"\")","v":""},{"$f":"IFERROR(IF($BX22=\"C\",$CH22*$G22,$CH22*$H22),0)","v":0},{"$f":"IFERROR(\nIF(OR($BY22=\"CN\",$BY22=\"CL\"),\n  IF($BX22=\"C\",$G22*$CI22,$H22*$CI22),\n$CI22*$AL22),0)","v":0},{"$f":"IFERROR(IF(DB22=\"\",\nIF(AND($CJ22<>\"\",$CK22<>\"\"),MIN($CJ22,$CK22),0),\n\"\"),0)","v":0},{"$f":"IF(AND(CL22<>\"\",CL22<>0),CL22+IF(CY22>0,CY22,0),0)","v":0},"-","",{"$f":"IFERROR(IF($BX22=\"R\",DC22*VLOOKUP(CN22,RemovalTable,2,FALSE),0),0)","v":0},false,false,false,false,true,0,{"$f":"IFERROR(IF($DB22=\"\",\nIF(CV22=0,0,\nIF(BonusCap=0,ROUND(CV22*CE22,0),\nMIN(BonusCap,ROUND(CV22*CE22,0))\n)),0),0)","v":0},0,{"$f":"IFERROR(IF(DB22=\"\",\nIF(CX22=0,0,\nIF(BonusCap=0,ROUND(CX22*CL22,0),\nIF(CW22=BonusCap,0,\nIF((CW22+CX22*CL22)>BonusCap,BonusCap-CW22,\nROUND(CX22*CL22,0))))),0),0)","v":0},{"$f":"IFERROR(\nIF($DB22=\"\",\nIF($BX22=\"R\",$CP22,SUM(CE22,CL22)),0),0)","v":0},0,{"$f":"InputErrorCheck(E22,F22,L22,BS22,M22,Q22,G22,V22,W22,AA22,H22,AD22,BV22,AK22,AL22)","v":""},{"$f":"IFERROR(IF(OR($BX22=\"C\",$BX22=\"X\"),\"-\",\nIF($BX22=\"R\",$G22,\nIF($G22<$H22,\nIF(AND($BS22<>\"H\",$BS22<>\"E\",$BS22<>\"O\",OR($BU22=\"L\",$BU22=\"LD\")),$W22*$G22,\n$G22),\nIF(AND($BS22<>\"H\",$BS22<>\"E\",$BS22<>\"O\",OR($BU22=\"L\",$BU22=\"LD\")),$X22,\n$H22)))),\"\")","v":0},"","",{"$f":"IFERROR(\nIF(OR(SUM($CJ22)=0,SUM($CK22=0)),\"\",\nIF(CJ22>CK22,\"$\"&CI22&\"/Sen\",\nIF(OR(BY22=\"CN\",BY22=\"CL\"),\n  IF(BX22=\"C\",\"$\"&ROUND(CL22/G22,1)&\"/Sen\",\"$\"&ROUND(CL22/H22,1)&\"/Sen\"),\n\"$\"&ROUND(CL22/AL22,1)&\"/Sen\"))),\"\")","v":""},{"$f":"CW22+CY22","v":0},{"$f":"CZ22","v":0},{"$f":"IF($DB22=\"\",CZ22+CW22+CY22,VLOOKUP(DB22,ErrorCheckingTable,3,FALSE))","v":0}]
[null,null,null,null,null,null,{"$f":"SUM(G18:G22)","v":0},{"$f":"SUM(H18:H22)","v":0},null,null,null,null,null,null,null,null,null,{"$f":"SUMIF($DB$18:$DB$22,\"\",R18:R22)","v":0},null,null,null,null,null,null,null,null,null,{"$f":"SUMIF($DB$18:$DB$22,\"\",AB18:AB22)","v":0},null,null,null,null,null,null,null,null,null,null,null,{"$f":"SUM(AN18:AN22)","v":0},{"$f":"SUMIF($DB$18:$DB$22,\"\",AO18:AO22)","v":0},0,0,0,0,0,0,0,0,0,0,0,0,{"$f":"SUM(BB18:BB22)","v":0},{"$f":"SUM(BC18:BC22)","v":0},{"$f":"SUM(BD18:BD22)","v":0},null,{"$f":"SUM(BF18:BF22)","v":0},{"$f":"SUM(BG18:BG22)","v":0},{"$f":"SUM(BH18:BH22)","v":0},null,null,null,{"$f":"SUM(BL18:BL22)","v":0},0,0,0,0,0,0,null,null,null,null,null,null,null,null,null,null,null,null,{"$f":"SUM(CE18:CE22)","v":0},{"$f":"SUM(CF18:CF22)","v":0},null,null,null,null,null,{"$f":"SUM(CL18:CL22)","v":0},{"$f":"SUM(CM18:CM22)","v":0},null,null,{"$f":"SUM(CP18:CP22)","v":0},null,null,null,"Bonus Cap",0,"Totals:",null,null,null,{"$f":"MIN(TotalCost,SUM(CZ18:CZ22))","v":0},{"$f":"IF(SUM(TotalCost)=0,ProjDevMin,\nIF(AND(PDItoCust,NOT(AoF)),MAX(0,MIN(TotalCost-MaxRebate,MAX(SUM(DA18:DA22),ProjDevMin))),\nMAX(SUM(DA18:DA22),ProjDevMin)))","v":50},null,null,null,null,null,null,"Total Maximum Rebate:",{"$f":"MIN(TotalCost,SUM(DI18:DI22))","v":0}]
[null,null,null,null,null,null,null,null,null,null,null,null,null,null,null,null,null,null,null,null,null,null,null,null,null,null,null,null,null,null,null,null,null,null,null,null,null,null,null,null,null,"kW Controls",{"$f":"SUMIF(CL18:CL22,\">0\",AN18:AN22)","v":0},null,"#Fixts Controlled",{"$f":"SUMIF(CL18:CL22,\">0\",H18:H22)","v":0},null,null,null,null,null,null,null,null,null,null,null,null,null,null,null,null,null,null,null,null,null,null,null,null,null,null,null,null,null,null,null,null,null,null,null,null,null,null,null,null,null,null,null,null,null,null,null,null,null,null,null,null,null,null,null,null,null,null,null,null,null,null,null,null,null,"Maximum Rebate / kWh:",{"$f":"IFERROR($DI$23/$BH$23,\"\")","v":""}]
[]
[null,null,null,null,null,null,null,null,null,null,null,null,null,null,null,null,null,null,null,null,null,null,null,null,null,null,null,null,null,null,null,null,"Existing Energy Use as a % of Facility Total Electrical Use: ",{"$f":"ExistingPercentofTotalUse","v":""},null,null,null,null,null,null,null,null,null,null,null,null,null,null,null,null,null,null,null,null,"Total Electrical Energy Savings:",{"$f":"SUM($BH$23)","v":0}]
[]
[]
[null,null,"Notes:"]
[]
[null,null,null,null,null,null,null,null,null,null,null,null,null,null,null,null,null,null,null,null,null,null,null,null,null,null,null,null,null,null,null,null,null,null,null,null,null,null,null,null,null,null,null,null,null,null,null,null,null,null,null,null,null,null,null,null,null,null,null,null,null,null,null,null,null,null,null,null,null,null,null,null,null,null,null,null,null,null,null,null,null,null,null,null,null,null,null,null,null,null,null,null,null,null,null,null,null,null,null,null,null,null,null,null,null,null,null,null,null,null,null,null,null,{"$f":"Version","v":"Version April 2025 - Effective Date April 1st, 2025"}]

{"sheet":"Verification Report","index":7,"n_rows":52,"n_cols":19,"rows_kept":52,"cut":false,"hidden":true,"merged":[[9,2,9,7],[7,2,7,13],[9,18,9,19],[51,18,51,19],[46,2,49,19],[25,2,43,19],[7,17,7,19],[7,14,7,16],[9,14,9,16],[9,8,9,13],[24,2,24,19],[8,14,8,16],[8,8,8,13],[8,2,8,7],[6,14,6,16],[8,18,8,19],[2,2,2,19],[6,17,6,19],[4,2,4,19],[6,2,6,13]]}
[]
[]
[null,null,{"$f":"BannerText","v":"Energy Services  ●  eebiz@snopud.com  ●  www.snopud.com"}]
[]
[null,null,"Energy Efficiency Project Verification Report"]
[]
[null,null," Project Name",null,null,null,null,null,null,null,null,null,null,null," PUD Staff",null,null," Verification Date"]
[null,null,{"$f":"ProjectName","v":0},null,null,null,null,null,null,null,null,null,null,null,{"$f":"AssignedStaff","v":0}]
[null,null," Facility Name",null,null,null,null,null," Facility Address",null,null,null,null,null," City",null,null," State"," Zip Code"]
[null,null,{"$f":"FacilityName","v":"Facility Info"},null,null,null,null,null,{"$f":"App_FacAdd","v":0},null,null,null,null,null,{"$f":"App_FacCity","v":0},null,null,"WA",{"$f":"FacZip","v":0}]
[]
[null,null,"Project Characteristic",null,null,null,null,null,null,null,null,"Project Type"]
[null,null,null,null,"Existing Building",null,null,null,"New Construction",null,null,null,null,"Lighting Retrofits",null,null,null,"HVAC System "]
[null,null,null,null,"Equipment Upgrade",null,null,null,"Major Renovation",null,null,null,null,"Rebates - Small HVAC Unitary",null,null,null,"Large HVAC Unitary"]
[null,null,null,null,"New installation",null,null,null,"Remodel T/I",null,null,null,null,"Rebates - Others",null,null,null,"Process Equipment"]
[null,null,null,null,"New addition",null,null,null,"Change of Use",null,null,null,null,"Compressed Air",null,null,null,"Custom - Others "]
[]
[null,null,"Measurement & Verification (M&V)",null,null,null,null,null,null,"(check all that apply)"]
[null,null,null,null,"Pre-installation verification at site",null,null,null,null,null,null,null,null,"Post-installation verification at site"]
[null,null,null,null,"Pre-installation trend data",null,null,null,null,null,null,null,null,"Post-installation trend data"]
[null,null,null,null,"Pre-installation metering",null,null,null,null,null,null,null,null,"Post-installation metering"]
[null,null,null,null,"Progress inspection",null,null,null,null,null,null,null,null,"Pre- & post-installation verification of facility energy use"]
[]
[null,null,"Actions and Findings"]
[]
[]
[]
[]
[]
[]
[]
[]
[]
[]
[]
[]
[]
[]
[]
[]
[]
[]
[]
[]
[]
[null,null,"Recommendations"]
[]
[]
[]
[]
[]
[null,null,{"$f":"Version","v":"Version April 2025 - Effective Date April 1st, 2025"},null,null,null,null,null,null,null,null,null,null,null,"Initial: ",null,null,"Date:"]

{"sheet":"Payment Request","index":8,"n_rows":104,"n_cols":16,"rows_kept":104,"cut":false,"hidden":true,"merged":[[35,11,35,12],[44,2,44,5],[34,11,34,12],[60,9,60,12],[62,9,62,10],[62,11,62,12],[31,2,31,5],[31,6,31,8],[31,9,31,12],[36,7,36,8],[36,9,36,10],[36,11,36,12],[36,2,36,6],[45,2,45,5],[45,7,45,9],[45,10,45,12],[37,2,37,6],[37,7,37,8],[37,9,37,10],[37,11,37,12],[39,2,39,6],[39,7,39,9],[39,11,39,12],[41,2,41,6],[41,7,41,10],[41,11,41,12],[35,2,35,10],[82,2,82,10],[82,11,82,12],[92,2,92,5],[92,7,92,9],[92,10,92,12],[83,2,83,10],[83,11,83,12],[86,2,86,6],[86,7,86,9],[86,11,86,12],[70,2,70,10],[70,11,70,12],[72,2,72,6],[72,7,72,9],[72,11,72,12],[78,2,78,5],[78,6,78,8],[78,9,78,12],[77,2,77,6],[77,7,77,9],[77,10,77,12],[34,2,34,10],[38,2,38,6],[44,10,44,12],[44,7,44,9],[63,9,63,10],[63,11,63,12],[67,2,67,12],[52,2,52,12],[57,2,57,4],[57,9,57,12],[59,2,59,4],[59,9,59,12],[56,2,56,4],[56,9,56,12],[58,2,58,4],[58,9,58,12],[60,2,60,4],[49,2,49,12],[50,2,50,12],[40,11,40,12],[40,7,40,10],[40,2,40,6],[38,11,38,12],[38,7,38,9],[93,2,93,5],[93,7,93,9],[93,10,93,12],[87,2,87,6],[87,7,87,9],[87,11,87,12],[89,2,89,6],[89,7,89,10],[89,11,89,12],[88,2,88,6],[88,7,88,10],[88,11,88,12],[24,11,24,12],[24,7,24,9],[24,2,24,6],[30,9,30,12],[30,6,30,8],[30,2,30,5],[28,10,28,12],[28,7,28,9],[28,2,28,6],[29,2,29,6],[29,7,29,9],[29,10,29,12],[25,2,25,6],[25,7,25,9],[25,11,25,12],[2,2,2,12],[23,2,23,10],[23,11,23,12],[4,2,4,12],[9,2,9,4],[9,9,9,12],[11,2,11,4],[11,9,11,12],[13,2,13,4],[13,9,13,12],[15,9,15,10],[15,11,15,12],[19,2,19,12],[14,11,14,12],[14,9,14,10],[12,9,12,12],[22,11,22,12],[22,2,22,10],[10,9,10,12],[12,2,12,4],[10,2,10,4],[8,9,8,12],[8,2,8,4],[61,2,61,4],[61,9,61,12],[79,2,79,5],[79,6,79,8],[85,2,85,6],[85,7,85,8],[85,9,85,10],[85,11,85,12],[73,7,73,9],[79,9,79,12],[71,2,71,10],[71,11,71,12],[73,2,73,6],[84,2,84,6],[73,11,73,12],[76,2,76,6],[76,7,76,9],[76,10,76,12],[84,7,84,8],[84,9,84,10],[84,11,84,12]]}
[]
[]
[null,null,{"$f":"BannerText","v":"Energy Services  ●  eebiz@snopud.com  ●  www.snopud.com"}]
[]
[null,null,"Energy Efficiency Project Incentive Payment"]
[]
[]
[null,null,null,null,null,null,null,null,null,"Payment Processing"]
[null,null,"To",null,null,null,null,null,null,"Warrant #"]
[null,null,"Accounts Payable"]
[null,null,"From",null,null,null,null,null,null,"Purchase Requisition (PR) #",null,null,null,null,null,"Mail Check Flag"]
[null,null,"Project Lead",null,null,null,null,null,null,null,null,null,null,null,null,1]
[null,null,"Date",null,null,null,null,null,null,"Purchase Order (PO) / Service Entry Sheet (SES) #"]
[]
[null,null,null,null,null,null,null,null,null,"Residential",null,"Non-Residential"]
[null,null,null,"Please remit payment to Recipient",null,null,null,null,null,null,null,"X"]
[null,null,null,"Please deliver check to Energy Services"]
[]
[null,null,"Payment Notes:"]
[]
[]
[null,null,"RECIPIENT INFORMATION"]
[null,null,"Vendor Name (Customer)",null,null,null,null,null,null,null,null,"Vendor #"]
[null,null,{"$f":"IF(AoF,ContractorW9Name,CustW9Name)","v":0},null,null,null,null,null,null,null,null,{"$f":"IF(AoF,ContVendor,CustVendor)","v":0}]
[null,null,"Mailing Address",null,null,null,null,"City",null,null,"State","Zip Code"]
[null,null,{"$f":"IF(AoF,ContractorMailingAddress,CustMailingAddress)","v":0},null,null,null,null,{"$f":"IF(AoF,ContractorCity,CustCity)","v":0},null,null,{"$f":"IF(AoF,ContractorState,CustState)","v":0},{"$f":"IF(AoF,ContractorZip,CustZip)","v":0}]
[]
[null,null,"ACCOUNTS PAYABLE INFORMATION"]
[null,null,"Project Name",null,null,null,null,"Project Engineer",null,null,"Amount"]
[null,null,{"$f":"ProjectName","v":0},null,null,null,null,{"$f":"AssignedStaff","v":0},null,null,{"$f":"IF(OR(AND(NOT(AoF),PDItoCust),AND(AoF,NOT(PDItoCust))),\nSUM(MIN(FinalProjCost,SUM(FinalBaseIncentive,FinalBonusIncentive)),FinalAdminIncentive),\nMIN(FinalProjCost,SUM(FinalBaseIncentive,FinalBonusIncentive)))","v":0}]
[null,null,"G/L Account - Cost Element",null,null,null,"Internal Order #",null,null,"WBS Order Description (EE Program Name)"]
[null,null,614219,null,null,null,900314,null,null,"Lighting Efficiency"]
[]
[null,null,"ENERGY EFFICIENCY PROJECT INFORMATION"]
[null,null,"Business Name",null,null,null,null,null,null,null,null,"Vendor #"]
[null,null,{"$f":"CustW9Name","v":0},null,null,null,null,null,null,null,null,{"$f":"CustVendor","v":0}]
[null,null,"Facility Name",null,null,null,null,"Average Load Reduction",null,"Winter Peak Load Reduction",null,"Annual Energy Savings"]
[null,null,{"$f":"FacilityName","v":"Facility Info"},null,null,null,null,{"$f":"kWReduction","v":0},null,{"$f":"kWReductionPeak","v":0},null,{"$f":"TotalSavings","v":0}]
[null,null,"Facility Address",null,null,null,null,"City",null,null,"State","Zip Code"]
[null,null,{"$f":"App_FacAdd","v":0},null,null,null,null,{"$f":"App_FacCity","v":0},null,null,"WA",{"$f":"App_FacZip","v":0}]
[null,null,"Contact Name",null,null,null,null,"Email",null,null,null,"Phone Number"]
[null,null,{"$f":"CustPrimaryContactName","v":0},null,null,null,null,{"$f":"CustPrimaryContactEmail","v":0},null,null,null,{"$f":"CustPrimaryContactPhone","v":0}]
[]
[null,null,"APPROVAL"]
[null,null,"Approval Signature(s)",null,null,null,"Date","Name",null,null,"Title"]
[null,null,null,null,null,null,null,null,null,null,"Project Lead"]
[null,null,{"$f":"Version","v":"Version April 2025 - Effective Date April 1st, 2025"}]
[]
[]
[null,null,"Below For Non-Assignment of Funds Only"]
[null,null,{"$f":"BannerText","v":"Energy Services  ●  eebiz@snopud.com  ●  www.snopud.com"}]
[]
[null,null,"Energy Efficiency Project Development Incentive Payment"]
[]
[]
[null,null,null,null,null,null,null,null,null,"Payment Processing"]
[null,null,"To",null,null,null,null,null,null,"Warrant #"]
[null,null,"Accounts Payable"]
[null,null,"From",null,null,null,null,null,null,"Purchase Requisition (PR) #",null,null,null,null,null,"Mail Check Flag"]
[null,null,"Project Lead",null,null,null,null,null,null,null,null,null,null,null,null,1]
[null,null,"Date",null,null,null,null,null,null,"Purchase Order (PO) / Service Entry Sheet (SES) #"]
[null,null,{"$f":"PayReqDate","v":"00:00:00"}]
[null,null,null,null,null,null,null,null,null,"Residential",null,"Non-Residential"]
[null,null,"Please remit payment to Recipient",null,null,null,null,null,null,null,null,"X"]
[]
[]
[null,null,"Payment Notes:"]
[]
[]
[null,null,"RECIPIENT INFORMATION"]
[null,null,"Vendor Name (Customer)",null,null,null,null,null,null,null,null,"Vendor #"]
[null,null,{"$f":"IF(PDItoCust,CustW9Name,ContractorW9Name)","v":0},null,null,null,null,null,null,null,null,{"$f":"IF(PDItoCust,CustVendor,ContVendor)","v":0}]
[null,null,"Mailing Address",null,null,null,null,"City",null,null,"State","Zip Code"]
[null,null,{"$f":"IF(PDItoCust,CustMailingAddress,ContractorMailingAddress)","v":0},null,null,null,null,{"$f":"IF(PDItoCust,CustCity,ContractorCity)","v":0},null,null,{"$f":"IF(PDItoCust,CustState,ContractorState)","v":0},{"$f":"IF(PDItoCust,CustZip,ContractorZip)","v":0}]
[]
[null,null,"ACCOUNTS PAYABLE INFORMATION"]
[null,null,"Project Name",null,null,null,null,"Project Engineer",null,null,"Amount"]
[null,null,{"$f":"ProjectName","v":0},null,null,null,null,{"$f":"AssignedStaff","v":0},null,null,{"$f":"FinalAdminIncentive","v":0}]
[null,null,"G/L Account - Cost Element",null,null,null,"Internal Order #",null,null,"WBS Order Description (EE Program Name)"]
[null,null,614219,null,null,null,900314,null,null,"Lighting Efficiency"]
[]
[null,null,"ENERGY EFFICIENCY PROJECT INFORMATION"]
[null,null,"Business Name",null,null,null,null,null,null,null,null,"Vendor #"]
[null,null,{"$f":"CustW9Name","v":0},null,null,null,null,null,null,null,null,{"$f":"CustVendor","v":0}]
[null,null,"Facility Name",null,null,null,null,"Average Load Reduction",null,"Winter Peak Load Reduction",null,"Annual Energy Savings"]
[null,null,{"$f":"FacilityName","v":"Facility Info"},null,null,null,null,{"$f":"kWReduction","v":0},null,{"$f":"kWReductionPeak","v":0},null,{"$f":"TotalSavings","v":0}]
[null,null,"Facility Address",null,null,null,null,"City",null,null,"State","Zip Code"]
[null,null,{"$f":"App_FacAdd","v":0},null,null,null,null,{"$f":"App_FacCity","v":0},null,null,"WA",{"$f":"App_FacZip","v":0}]
[null,null,"Contact Name",null,null,null,null,"Email",null,null,null,"Phone Number"]
[null,null,{"$f":"CustPrimaryContactName","v":0},null,null,null,null,{"$f":"CustPrimaryContactEmail","v":0},null,null,null,{"$f":"CustPrimaryContactPhone","v":0}]
[]
[null,null,"APPROVAL"]
[null,null,"Approval Signature(s)",null,null,null,"Date","Name",null,null,"Title"]
[null,null,null,null,null,null,null,null,null,null,"Project Lead"]
[null,null,{"$f":"Version","v":"Version April 2025 - Effective Date April 1st, 2025"}]
[]
[]
[]
[]
[]
[]
[]
[null,"Customer was original payee but payment is now going to the contractor. Business name and vendor number has been updated to the contractor’s information."]
[null,"Contractor was original payee but payment is now going to the customer. Business name and vendor number has been updated to the customer’s information."]

{"sheet":"Pay Letter - Assignee","index":9,"n_rows":34,"n_cols":3,"rows_kept":34,"cut":false,"hidden":true,"merged":[]}
[]
[]
[]
[]
[]
[]
[]
[]
[null,{"$f":"CONCATENATE(TEXT(TODAY(),\"mmmm d, yyyy\"))","v":"April 1, 2025"}]
[]
[]
[null,{"$f":"IF(ContractorW9Name=\"Self-Install\",\"Go To Application Worksheet and Fill-In Contractor Company Name to Self-Populate\",ContractorW9Name)","v":0}]
[null,{"$f":"IF(ContractorContactName=\"\",\"Go To Application Worksheet and Fill-In Contractor Contact Name to Self-Populate\",\"Attn: \"&ContractorContactName)","v":"Attn: 0"}]
[null,{"$f":"IF(ContractorMailingAddress=0,\"Go To Application Worksheet and Fill-In Contractor Street Address to Self-Populate\",ContractorMailingAddress)","v":"Go To Application Worksheet and Fill-In Contractor Street Address to Self-Populate"}]
[null,{"$f":"IF(ContractorCity=0,\"Go To Application Worksheet and Fill-In, City, State, Zip Code to Self-Populate\",ContractorCity&\", \"&ContractorState&\" \"&ContractorZip)","v":"Go To Application Worksheet and Fill-In, City, State, Zip Code to Self-Populate"}]
[]
[null,{"$f":"IF(FacilityName=\"\", \"Go To Application Worksheet and Fill-In Facility/Business Name to Self-Populate \",\"Re: Payment for \"&FacilityName&\" LED Lighting Rebate\")","v":"Re: Payment for Facility Info LED Lighting Rebate"}]
[]
[null,{"$f":"IFERROR(IF(ContractorW9Name=\"\",\"Go To Application Worksheet and Fill-In Contractor Contact Name to Self-Populate\",\"Dear \"&LEFT(ContractorContactName,FIND(\" \",ContractorContactName,1)-1)&\",\"),\"Go To Application Worksheet and Fill-In Contractor Contact Name to Self-Populate\")","v":"Go To Application Worksheet and Fill-In Contractor Contact Name to Self-Populate"}]
[]
[null,{"$f":"\"The PUD has approved payment to \"&ContractorW9Name&\nIF(App_ContPayPref=\"Electronic (ACH)\",\" via ACH\",\"\")&\n\" in the amount of \"&\nIF(AND(AoF,NOT(PDItoCust)),\nIFERROR(DOLLAR(FinalBaseIncentive+FinalBonusIncentive,2),0)&\" as assigned by \"&CustW9Name&\" and \"&IFERROR(DOLLAR(FinalAdminIncentive,2),0)&\" for the development and admininstration of the energy efficiency project above.\",\nIF(AND(AoF,PDItoCust),\nIFERROR(DOLLAR(FinalBaseIncentive+FinalBonusIncentive,2),0)&\" as assigned by \"&CustW9Name&\" for the energy efficiency project above.\",\nIFERROR(DOLLAR(FinalAdminIncentive,2),0)&\" for the development and administration of the energy efficiency project above.\"))","v":"The PUD has approved payment to 0 in the amount of $0.00 for the development and administration of the energy efficiency project above."}]
[]
[null,"Thank you for participating in our Energy Efficiency programs. We are looking forward to working with you again in the near future. Please don't hesitate to contact me with any questions you may have."]
[]
[null,"Sincerely,"]
[]
[null,{"$f":"IF(AssignedStaff=\"\",\"Engineer\",AssignedStaff)","v":"Engineer"},"<DropDown List For Engineer"]
[null,{"$f":"B27","v":"Engineer"}]
[null,{"$f":"IFERROR(VLOOKUP($B$28,PayLetterContactInfo,2,FALSE),\"Title\")","v":"Title"}]
[null,"Snohomish County PUD No.1"]
[null,{"$f":"IFERROR(VLOOKUP($B$28,PayLetterContactInfo,3,FALSE),\"Phone\")","v":"Phone"}]
[null,{"$f":"IFERROR(VLOOKUP($B$28,PayLetterContactInfo,4,FALSE),\"Email\")","v":"Email"}]
[]
[null,{"$f":"IF(ProjectName=\"\",\"Reference: SnoPUD Project Name\", \"Reference: SnoPUD Project Name \"&ProjectName)","v":"Reference: SnoPUD Project Name"}]

{"sheet":"Pay Letter - Customer","index":10,"n_rows":44,"n_cols":3,"rows_kept":44,"cut":false,"hidden":true,"merged":[]}
[]
[]
[]
[]
[]
[]
[]
[]
[null,{"$f":"CONCATENATE(TEXT(TODAY(),\"mmmm d, yyyy\"))","v":"April 1, 2025"}]
[]
[]
[null,{"$f":"IF(CustW9Name=0,\"Cust. Business Name \",CustW9Name)","v":"Cust. Business Name "}]
[null,{"$f":"IF(CustPrimaryContactName=0,\"Business Contact Name \",\"Attn: \"&CustPrimaryContactName)","v":"Business Contact Name "}]
[null,{"$f":"IF(CustMailingAddress=0,\"Business Mailing Address \",CustMailingAddress)","v":"Business Mailing Address "}]
[null,{"$f":"IF(CustCity=0,\"City, State, Zip Code\",CustCity&\", \"&CustState&\" \"&CustZip)","v":"City, State, Zip Code"}]
[]
[null,{"$f":"IF(FacilityName=\"\", \"Facility/Business Name\",\"Re: Payment for \"&FacilityName&\" LED Lighting Rebate\")","v":"Re: Payment for Facility Info LED Lighting Rebate"}]
[]
[null,{"$f":"IF(CustPrimaryContactName=0,\"Go To Application Worksheet and Fill-In Contractor Contact Name to Self-Populate\",\"Dear \"&LEFT(CustPrimaryContactName,FIND(\" \",CustPrimaryContactName,1)-1)&\",\")","v":"Go To Application Worksheet and Fill-In Contractor Contact Name to Self-Populate"}]
[]
[null,{"$f":"\"Thank you for your conservation efforts! The PUD has approved payment to \"&\nIF(AoF,\"your Assignee, \"&ContractorW9Name,CustW9Name)&\n\", in the amount of \"&DOLLAR(SUM(FinalBaseIncentive,FinalBonusIncentive),2)&\" for the energy efficiency project above\"&\nIF(PDItoCust,\", as well as a project development incentive payment of \"&DOLLAR(SUM(FinalAdminIncentive),2)&\nIF(AoF,\" to \"&CustW9Name,\"\"),\"\")&\n\".\"","v":"Thank you for your conservation efforts! The PUD has approved payment to 0, in the amount of $0.00 for the energy efficiency project above, as well as a project development incentive payment of $0.00."}]
[null,{"$f":"\"This project is estimated to save \"&IFERROR(DOLLAR(EstAnnualCostSavings,0),0)&\" per year in avoided energy costs.\"","v":"This project is estimated to save $0 per year in avoided energy costs."}]
[null,null,true]
[null,"Energy conservation is our lowest cost resource! As our community's energy needs grow, it is more important than ever that we raise awareness of energy efficiency and help all of us use energy wisely."]
[]
[null,"Your facility's next opportunities are:","Hide or Unhide any cells you don't need"]
[null,"Building Controls","<DropDown List For Opportunities"]
[null,"Commercial Kitchen Equipment","<DropDown List For Opportunities"]
[null,"Compressed Air","<DropDown List For Opportunities"]
[null,"Engine Block Heaters","<DropDown List For Opportunities"]
[null,"Heat Pumps (including ductless)","<DropDown List For Opportunities"]
[]
[null,"Thank you for participating in our Energy Efficiency programs. We are looking forward to working with you again in the near future. Please don't hesitate to contact me with any questions you may have."]
[]
[null,"Sincerely,"]
[]
[null,{"$f":"IF(AssignedStaff=\"\",\"Engineer\",AssignedStaff)","v":"Engineer"},"<DropDown List For Engineer"]
[null,{"$f":"B37","v":"Engineer"}]
[null,{"$f":"IFERROR(VLOOKUP($B$37,PayLetterContactInfo,2,FALSE),\"Title\")","v":"Title"}]
[null,"Snohomish County PUD No.1"]
[null,{"$f":"IFERROR(VLOOKUP($B$37,PayLetterContactInfo,3,FALSE),\"Phone\")","v":"Phone"}]
[null,{"$f":"IFERROR(VLOOKUP($B$37,PayLetterContactInfo,4,FALSE),\"Email\")","v":"Email"}]
[]
[null,{"$f":"IF(ProjectName=\"\",\"Reference: SnoPUD Project Name\", \"Reference: SnoPUD Project Name \"&ProjectName)","v":"Reference: SnoPUD Project Name"}]

{"sheet":"Input Tables","index":11,"n_rows":311,"n_cols":58,"rows_kept":311,"cut":false,"hidden":true,"merged":[[5,5,5,7],[8,41,9,41],[8,30,9,30],[8,32,8,39],[8,43,8,57],[5,8,5,16]]}
[]
[null,"Workbook Version","L",null,"Rebate Cap","PDI Minimum","PDI Base Rate","PDI Net. Controls","PDI LLLCs","Bonus Incentive",null,null,null,null,null,null,null,null,null,null,null,null,null,null,null,null,null,null,null,null,null,null,null,"Top","Left","Open?"]
[null,"Version","Effective Date",null,{"$f":"IF(TotalCost=0,500000,MIN(TotalCost,500000))","v":500000},50,{"$f":"IF(NXTLevelCert,OFFSET(LookupPDI_NXT,MATCH(IncentiveRateActive,LookupIncentiveRates,0),0),\nOFFSET(LookupPDI_Base,MATCH(IncentiveRateActive,LookupIncentiveRates,0),0))","v":0.02},{"$f":"OFFSET(LookupPDI_Networked,MATCH(IncentiveRateActive,LookupIncentiveRates,0),0)","v":0.01},{"$f":"OFFSET(LookupPDI_LLLC,MATCH(IncentiveRateActive,LookupIncentiveRates,0),0)","v":1.4999999999999999E-2},0,null,null,null,null,null,null,null,null,null,null,null,null,null,null,null,null,null,null,null,null,null,null,"Fixt Schedule",null,null,false,"Open Schedule after Edit"]
[null,"April 2025","April 1st, 2025",null,null,null,null,null,null,null,null,null,null,null,null,null,null,null,null,null,null,null,null,null,null,null,null,null,null,null,null,null,"Add Existing",null,null,null,"QRT to Edit"]
[null,null,{"$f":"\"Version \"&$B$4&\" - Effective Date \"&$C$4","v":"Version April 2025 - Effective Date April 1st, 2025"},null,null,null,null,null,null,null,null,null,null,null,null,null,null,null,null,null,null,null,null,null,null,null,null,null,null,null,null,null,"Add New",null,null,null,"Fixt to Select"]
[null,null,null,null,null,"Fixture Input Options",null,null,"Lighting Input Table 'Enabled' Validation Map (i.e. False = Locked)"]
[null,"Fixture Type","Type Lookup","Rebate Type","RebateType Lookup","Lamp Qty","Lamp Wattage","Ballast Type","Fixture Type","# of Fixtures","# of Lamps / Fixture","# of Lamps / Fixture\nValidation","Lamp Wattage","Lamp Wattage\nValidation Type","Ballast Type","Watts / Fixture","Watts / Fixture Validation"]
[null,null,null,null,null,null,null,null,true,true,false,false,false,0,false,false,false,null,"Lamp / Fixture Wattage Table "]
[null,"Linear Fluor - 2' T8","LF2ftT8","Linear","L","1,2,3,4,6","17W,40W (Biax),55W (Biax)","LBF,NBF,HBF",true,true,true,true,true,1,true,false,false,null,"Lamp w/ Ballast","1L","2L","3L","4L","5L","6L","7L","8L",null,null,null,"Existing Validation List",null,"Existing Lighting ID Reference Table",null,null,null,null,null,null,null,null,"Proposed Validation List",null,"Proposed Lighting ID Reference Table"]
[null,"Linear Fluor - 4' T8","LF4ftT8","Linear","L","1,2,3,4,6,8","25W,28W,32W","LBF,NBF,HBF",true,true,true,true,true,1,true,false,false,null,"IncA(40W)",40,{"$f":"T10*2","v":80},null,null,null,null,null,null,null,null,null,null,null,"Fixt ID","Lighting Technology","Fixture Type","Lamps / Fixture","Lamp Wattage","Watts / Fixture","Ballast Type","Notes",null,null,null,"Fixt ID","Lighting Technology","Make","Model #","Wattage","Qualified","Power Factor < 0.9","5+ Year Warranty","uL / ETL Certification","Unit Cost","Controls","Fixture Type","Lamps / Fixture","Control Strategies","Controls DLC"]
[null,"Linear Fluor - 2' T5/HO","LF2ftT5","Linear","L","1,2,3,4,6","14W,24W (HO)","Std-Elect",true,true,true,true,true,1,true,false,false,null,"IncA(60W)",60,{"$f":"T11*2","v":120},null,null,null,null,null,null,null,null,null,"Add New",null,null,null,null,null,null,null,null,null,null,"Add New"]
[null,"Linear Fluor - 4' T5/HO","LF4ftT5","Linear","L","1,2,3,4,6,8","25-26W,28W,44-47W (HO),49-51W (HO),54W (HO)","Std-Elect",true,true,true,true,true,1,true,false,false,null,"IncA(75W)",75,{"$f":"T12*2","v":150},null,null,null,null,null,null,null,null,1,{"$f":"IFERROR(INDEX(IDRefTable_Existing[Fixt ID],AD12),\"\")","v":0},null,null,null,null,null,null,null,null,null,null,{"$f":"IFERROR(INDEX(IDRefTable_Proposed[Fixt ID],AD12),\"\")","v":0}]
[null,"Linear Fluor - 2' T12","LF2ftT12","T12Linear","L","1,2,3,4","20W","All",true,true,true,true,true,1,true,false,false,null,"IncA(100W)",100,{"$f":"T13*2","v":200},null,null,null,null,null,null,null,null,{"$f":"AD12+1","v":2},{"$f":"IFERROR(INDEX(IDRefTable_Existing[Fixt ID],AD13),\"\")","v":""},null,null,null,null,null,null,null,null,null,null,{"$f":"IFERROR(INDEX(IDRefTable_Proposed[Fixt ID],AD13),\"\")","v":""}]
[null,"Linear Fluor - 4' T12","LF4ftT12","T12Linear","4'T12-L","1,2,3,4,6","34W-40W","All",true,true,true,true,true,1,true,false,false,null,"Inc(5W)",5,{"$f":"T14*2","v":10},null,null,null,null,null,null,null,null,{"$f":"AD13+1","v":3},{"$f":"IFERROR(INDEX(IDRefTable_Existing[Fixt ID],AD14),\"\")","v":""},null,null,null,null,null,null,null,null,null,null,{"$f":"IFERROR(INDEX(IDRefTable_Proposed[Fixt ID],AD14),\"\")","v":""}]
[null,"Linear Fluor - 8' T12","LF8ftT12","T12Linear","8'T12-L","1,2,3,4","60W-75W,95W-110W,185W-215W","All",true,true,true,true,true,1,true,false,false,null,"Inc(7W)",7,{"$f":"T15*2","v":14},null,null,null,null,null,null,null,null,4,{"$f":"IFERROR(INDEX(IDRefTable_Existing[Fixt ID],AD15),\"\")","v":""},null,null,null,null,null,null,null,null,null,null,{"$f":"IFERROR(INDEX(IDRefTable_Proposed[Fixt ID],AD15),\"\")","v":""}]
[null,"Linear (Other)","LFOther","Linear","L","N/A","N/A","N/A",true,true,false,false,false,0,false,true,true,null,"Inc(10W)",10,20,null,null,null,null,null,null,null,null,5,{"$f":"IFERROR(INDEX(IDRefTable_Existing[Fixt ID],AD16),\"\")","v":""},null,null,null,null,null,null,null,null,null,null,{"$f":"IFERROR(INDEX(IDRefTable_Proposed[Fixt ID],AD16),\"\")","v":""}]
[null,"Metal Halide","MH","HID","H","1","35W,50W,70W,100W,150W,175W,200W,250W,320W,400W,750W,1000W,1500W","Mag,Pulse-Start",true,true,true,true,true,1,true,false,false,null,"Inc(15W)",15,30,null,null,null,null,null,null,null,null,6,{"$f":"IFERROR(INDEX(IDRefTable_Existing[Fixt ID],AD17),\"\")","v":""},null,null,null,null,null,null,null,null,null,null,{"$f":"IFERROR(INDEX(IDRefTable_Proposed[Fixt ID],AD17),\"\")","v":""}]
[null,"Ceramic Metal Halide","CMH","HID","H","1,2","20W,39W,50W,70W,100W,150W","Elect",true,true,true,true,true,1,true,false,false,null,"Inc(25W)",25,50,null,null,null,null,null,null,null,null,7,{"$f":"IFERROR(INDEX(IDRefTable_Existing[Fixt ID],AD18),\"\")","v":""},null,null,null,null,null,null,null,null,null,null,{"$f":"IFERROR(INDEX(IDRefTable_Proposed[Fixt ID],AD18),\"\")","v":""}]
[null,"High Pressure Sodium","HPS","HID","H","1","35W,50W,70W,100W,150W,200W,250W,310W,400W,600W,750W,1000W","Mag",true,true,true,true,true,1,true,false,false,null,"Inc(40W)",40,80,null,null,null,null,null,null,null,null,8,{"$f":"IFERROR(INDEX(IDRefTable_Existing[Fixt ID],AD19),\"\")","v":""},null,null,null,null,null,null,null,null,null,null,{"$f":"IFERROR(INDEX(IDRefTable_Proposed[Fixt ID],AD19),\"\")","v":""}]
[null,"Low Pressure Sodium","LPS","HID","H","1","18W,35W,55W,90W,135W,180W","Mag",true,true,true,true,true,1,true,false,false,null,"Inc(50W)",50,100,null,null,null,null,null,null,null,null,9,{"$f":"IFERROR(INDEX(IDRefTable_Existing[Fixt ID],AD20),\"\")","v":""},null,null,null,null,null,null,null,null,null,null,{"$f":"IFERROR(INDEX(IDRefTable_Proposed[Fixt ID],AD20),\"\")","v":""}]
[null,"Mercury Vapor","MV","HID","H","1","100W,175W,250W,400W,1000W","Mag",true,true,true,true,true,1,true,false,false,null,"Inc(60W)",60,120,null,null,null,null,null,null,null,null,10,{"$f":"IFERROR(INDEX(IDRefTable_Existing[Fixt ID],AD21),\"\")","v":""},null,null,null,null,null,null,null,null,null,null,{"$f":"IFERROR(INDEX(IDRefTable_Proposed[Fixt ID],AD21),\"\")","v":""}]
[null,"HID (Other)","HIDOther","HID","H","N/A","N/A","N/A",true,true,false,false,false,0,false,true,true,null,"Inc(65W)",65,{"$f":"T22*2","v":130},null,null,null,null,null,null,null,null,11,{"$f":"IFERROR(INDEX(IDRefTable_Existing[Fixt ID],AD22),\"\")","v":""},null,null,null,null,null,null,null,null,null,null,{"$f":"IFERROR(INDEX(IDRefTable_Proposed[Fixt ID],AD22),\"\")","v":""}]
[null,"eHID","eHID","HID","H","N/A","N/A","N/A",true,true,false,false,false,0,false,true,true,null,"Inc(75W)",75,150,null,null,null,null,null,null,null,null,12,{"$f":"IFERROR(INDEX(IDRefTable_Existing[Fixt ID],AD23),\"\")","v":""},null,null,null,null,null,null,null,null,null,null,{"$f":"IFERROR(INDEX(IDRefTable_Proposed[Fixt ID],AD23),\"\")","v":""}]
[null,"Plasma","Plas","HID","H","N/A","N/A","N/A",true,true,false,false,false,0,false,true,true,null,"Inc(90W)",90,180,null,null,null,null,null,null,null,null,13,{"$f":"IFERROR(INDEX(IDRefTable_Existing[Fixt ID],AD24),\"\")","v":""},null,null,null,null,null,null,null,null,null,null,{"$f":"IFERROR(INDEX(IDRefTable_Proposed[Fixt ID],AD24),\"\")","v":""}]
[null,"Induction","Ind","HID","H","N/A","N/A","N/A",true,true,false,false,false,0,false,true,true,null,"Inc(100W)",100,200,null,null,null,null,null,null,null,null,14,{"$f":"IFERROR(INDEX(IDRefTable_Existing[Fixt ID],AD25),\"\")","v":""},null,null,null,null,null,null,null,null,null,null,{"$f":"IFERROR(INDEX(IDRefTable_Proposed[Fixt ID],AD25),\"\")","v":""}]
[null,"Exit Sign","Exit","Exit","E","N/A","INC,CFL","N/A",true,true,false,false,true,1,false,false,false,null,"Inc(120W)",120,240,null,null,null,null,null,null,null,null,15,{"$f":"IFERROR(INDEX(IDRefTable_Existing[Fixt ID],AD26),\"\")","v":""},null,null,null,null,null,null,null,null,null,null,{"$f":"IFERROR(INDEX(IDRefTable_Proposed[Fixt ID],AD26),\"\")","v":""}]
[null,"Existing LED","Other","Other","O","N/A","N/A","N/A",true,true,false,false,false,0,false,true,true,null,"Inc(150W)",150,300,null,null,null,null,null,null,null,null,16,{"$f":"IFERROR(INDEX(IDRefTable_Existing[Fixt ID],AD27),\"\")","v":""},null,null,null,null,null,null,null,null,null,null,{"$f":"IFERROR(INDEX(IDRefTable_Proposed[Fixt ID],AD27),\"\")","v":""}]
[null,"Existing TLED","LFTLED","Linear","L","1,2,3,4,6,8",null,"Type A, Type B/C",true,true,true,true,true,2,true,false,false,null,"Inc(200W)",200,400,null,null,null,null,null,null,null,null,17,{"$f":"IFERROR(INDEX(IDRefTable_Existing[Fixt ID],AD28),\"\")","v":""},null,null,null,null,null,null,null,null,null,null,{"$f":"IFERROR(INDEX(IDRefTable_Proposed[Fixt ID],AD28),\"\")","v":""}]
[null,"Other (Specify in Notes)","Other","Other","O","N/A","N/A","N/A",true,true,false,false,false,0,false,true,true,null,"Inc(250W)",250,500,null,null,null,null,null,null,null,null,18,{"$f":"IFERROR(INDEX(IDRefTable_Existing[Fixt ID],AD29),\"\")","v":""},null,null,null,null,null,null,null,null,null,null,{"$f":"IFERROR(INDEX(IDRefTable_Proposed[Fixt ID],AD29),\"\")","v":""}]
[null,"Specialty Lighting","Sp","Sp","S","N/A","N/A","N/A",true,true,false,false,false,0,false,true,true,null,"Inc(300W)",300,600,null,null,null,null,null,null,null,null,19,{"$f":"IFERROR(INDEX(IDRefTable_Existing[Fixt ID],AD30),\"\")","v":""},null,null,null,null,null,null,null,null,null,null,{"$f":"IFERROR(INDEX(IDRefTable_Proposed[Fixt ID],AD30),\"\")","v":""}]
[null,"Incandescent (A-Lamp)","IncA","Non-Linear","N","1,2","40W,60W,75W,100W","N/A",true,true,true,false,true,1,false,false,false,null,"Inc(500W)",500,1000,null,null,null,null,null,null,null,null,20,{"$f":"IFERROR(INDEX(IDRefTable_Existing[Fixt ID],AD31),\"\")","v":""},null,null,null,null,null,null,null,null,null,null,{"$f":"IFERROR(INDEX(IDRefTable_Proposed[Fixt ID],AD31),\"\")","v":""}]
[null,"Incandescent (BR, G, etc.)","Inc","Non-Linear","N","1,2","5W,7W,10W,15W,25W,40W,50W,60W,65W,75W,90W,100W,120W,150W,200W,250W,300W,500W","N/A",true,true,true,false,true,1,false,false,false,null,"Hal(5W)",5,{"$f":"T32*2","v":10},null,null,null,null,null,null,null,null,21,{"$f":"IFERROR(INDEX(IDRefTable_Existing[Fixt ID],AD32),\"\")","v":""},null,null,null,null,null,null,null,null,null,null,{"$f":"IFERROR(INDEX(IDRefTable_Proposed[Fixt ID],AD32),\"\")","v":""}]
[null,"Halogen (PAR, MR16, etc.)","Hal","Non-Linear","N","1,2","5W,10W,20W,35W,40W,50W,60W,75W,90W,100W,120W,150W,250W,300W,500W,750W","N/A",true,true,true,false,true,1,false,false,false,null,"Hal(10W)",10,{"$f":"T33*2","v":20},null,null,null,null,null,null,null,null,22,{"$f":"IFERROR(INDEX(IDRefTable_Existing[Fixt ID],AD33),\"\")","v":""},null,null,null,null,null,null,null,null,null,null,{"$f":"IFERROR(INDEX(IDRefTable_Proposed[Fixt ID],AD33),\"\")","v":""}]
[null,"Ceramic MH (PAR, MR16, etc.)","CMHL","HID","N","1,2","20W,25W,39W,50W,70W,100W","Elect",true,true,true,false,true,1,true,false,false,null,"Hal(20W)",20,40,null,null,null,null,null,null,null,null,23,{"$f":"IFERROR(INDEX(IDRefTable_Existing[Fixt ID],AD34),\"\")","v":""},null,null,null,null,null,null,null,null,null,null,{"$f":"IFERROR(INDEX(IDRefTable_Proposed[Fixt ID],AD34),\"\")","v":""}]
[null,"Compact Fluor Lamp","CFL","Non-Linear","N","1,2","3W,5W,7W,9W,10W,11W,13W,14W,15W,16W,18W,19W,20W,23W,26W,30W,32W,36W,40W,42W,55W,60W,65W,80W,85W,100W,105W,150W,180W,200W","N/A",true,true,true,false,true,1,false,false,false,null,"Hal(35W)",35,70,null,null,null,null,null,null,null,null,24,{"$f":"IFERROR(INDEX(IDRefTable_Existing[Fixt ID],AD35),\"\")","v":""},null,null,null,null,null,null,null,null,null,null,{"$f":"IFERROR(INDEX(IDRefTable_Proposed[Fixt ID],AD35),\"\")","v":""}]
[null,"Compact Fluor Fixture / Kit","CFFixt","Non-Linear","N","1,2","13W,18W,26W,32W,42W,--,5W,7W,9W,24W,25W,27W,28W,36W,40W,50W,55W,57W,70W,80W","ES-Mag,Elect",true,true,true,true,true,1,true,false,false,null,"Hal(40W)",40,80,null,null,null,null,null,null,null,null,25,{"$f":"IFERROR(INDEX(IDRefTable_Existing[Fixt ID],AD36),\"\")","v":""},null,null,null,null,null,null,null,null,null,null,{"$f":"IFERROR(INDEX(IDRefTable_Proposed[Fixt ID],AD36),\"\")","v":""}]
[null,"LED Lamp","LEDL","L","A",null,null,null,true,true,true,false,true,2,false,false,false,null,"Hal(50W)",50,100,null,null,null,null,null,null,null,null,26,{"$f":"IFERROR(INDEX(IDRefTable_Existing[Fixt ID],AD37),\"\")","v":""},null,null,null,null,null,null,null,null,null,null,{"$f":"IFERROR(INDEX(IDRefTable_Proposed[Fixt ID],AD37),\"\")","v":""}]
[null,"TLED (Type A)","LEDL","TLED-L","A",null,null,null,true,true,true,false,true,2,false,false,false,null,"Hal(60W)",60,120,null,null,null,null,null,null,null,null,27,{"$f":"IFERROR(INDEX(IDRefTable_Existing[Fixt ID],AD38),\"\")","v":""},null,null,null,null,null,null,null,null,null,null,{"$f":"IFERROR(INDEX(IDRefTable_Proposed[Fixt ID],AD38),\"\")","v":""}]
[null,"TLED (Type B/C)","LEDL","TLED-L&D","A",null,null,null,true,true,true,false,true,2,false,false,false,null,"Hal(75W)",75,150,null,null,null,null,null,null,null,null,28,{"$f":"IFERROR(INDEX(IDRefTable_Existing[Fixt ID],AD39),\"\")","v":""},null,null,null,null,null,null,null,null,null,null,{"$f":"IFERROR(INDEX(IDRefTable_Proposed[Fixt ID],AD39),\"\")","v":""}]
[null,"LED Components","LEDFixt","Kit","A",null,null,null,true,true,false,false,false,0,false,true,true,null,"Hal(90W)",90,180,null,null,null,null,null,null,null,null,29,{"$f":"IFERROR(INDEX(IDRefTable_Existing[Fixt ID],AD40),\"\")","v":""},null,null,null,null,null,null,null,null,null,null,{"$f":"IFERROR(INDEX(IDRefTable_Proposed[Fixt ID],AD40),\"\")","v":""}]
[null,"LED Kit","LEDFixt","Kit","A",null,null,null,true,true,false,false,false,0,false,true,true,null,"Hal(100W)",100,200,null,null,null,null,null,null,null,null,30,{"$f":"IFERROR(INDEX(IDRefTable_Existing[Fixt ID],AD41),\"\")","v":""},null,null,null,null,null,null,null,null,null,null,{"$f":"IFERROR(INDEX(IDRefTable_Proposed[Fixt ID],AD41),\"\")","v":""}]
[null,"LED Fixture","LEDFixt","NF","A",null,null,null,true,true,false,false,false,0,false,true,true,null,"Hal(120W)",120,240,null,null,null,null,null,null,null,null,31,{"$f":"IFERROR(INDEX(IDRefTable_Existing[Fixt ID],AD42),\"\")","v":""},null,null,null,null,null,null,null,null,null,null,{"$f":"IFERROR(INDEX(IDRefTable_Proposed[Fixt ID],AD42),\"\")","v":""}]
[null,"Exit Sign","ExitLED","NF","E",null,null,null,null,null,null,null,null,null,null,null,null,null,"Hal(150W)",150,{"$f":"T43*2","v":300},null,null,null,null,null,null,null,null,32,{"$f":"IFERROR(INDEX(IDRefTable_Existing[Fixt ID],AD43),\"\")","v":""},null,null,null,null,null,null,null,null,null,null,{"$f":"IFERROR(INDEX(IDRefTable_Proposed[Fixt ID],AD43),\"\")","v":""}]
[null,"**Fixture Removal Only**","FRO","Removal","R",null,null,null,false,false,false,false,false,0,false,false,false,null,"Hal(250W)",250,500,null,null,null,null,null,null,null,null,33,{"$f":"IFERROR(INDEX(IDRefTable_Existing[Fixt ID],AD44),\"\")","v":""},null,null,null,null,null,null,null,null,null,null,{"$f":"IFERROR(INDEX(IDRefTable_Proposed[Fixt ID],AD44),\"\")","v":""}]
[null,"**Lighting Controls Only**","LCO","Controls","C",null,null,null,false,false,false,false,false,0,false,false,false,null,"Hal(300W)",300,600,null,null,null,null,null,null,null,null,34,{"$f":"IFERROR(INDEX(IDRefTable_Existing[Fixt ID],AD45),\"\")","v":""},null,null,null,null,null,null,null,null,null,null,{"$f":"IFERROR(INDEX(IDRefTable_Proposed[Fixt ID],AD45),\"\")","v":""}]
[null,"**Existing to Remain**","ETR","Remain","X",null,null,null,false,false,false,false,false,0,false,false,false,null,"Hal(500W)",500,1000,null,null,null,null,null,null,null,null,35,{"$f":"IFERROR(INDEX(IDRefTable_Existing[Fixt ID],AD46),\"\")","v":""},null,null,null,null,null,null,null,null,null,null,{"$f":"IFERROR(INDEX(IDRefTable_Proposed[Fixt ID],AD46),\"\")","v":""}]
[null,null,null,null,null,null,null,null,null,null,null,null,null,null,null,null,null,null,"Hal(750W)",750,1500,null,null,null,null,null,null,null,null,36,{"$f":"IFERROR(INDEX(IDRefTable_Existing[Fixt ID],AD47),\"\")","v":""},null,null,null,null,null,null,null,null,null,null,{"$f":"IFERROR(INDEX(IDRefTable_Proposed[Fixt ID],AD47),\"\")","v":""}]
[null,"General Tables",null,null,null,null,null,null,null,null,null,null,null,null,null,null,null,null,"CFL(3W)",3,6,null,null,null,null,null,null,null,null,37,{"$f":"IFERROR(INDEX(IDRefTable_Existing[Fixt ID],AD48),\"\")","v":""},null,null,null,null,null,null,null,null,null,null,{"$f":"IFERROR(INDEX(IDRefTable_Proposed[Fixt ID],AD48),\"\")","v":""}]
[null,null,null,null,"ProposedTypeTechnologyGen","ProposedTypeTechnologyLin",null,"LED Component % of Kit",null,"HVAC Adjutment Factors",null,null,"Burnout Reduction Table",null,"Sales Tax","Link Description","Link",null,"CFL(5W)",5,{"$f":"T49*2","v":10},null,null,null,null,null,null,null,null,38,{"$f":"IFERROR(INDEX(IDRefTable_Existing[Fixt ID],AD49),\"\")","v":""},null,null,null,null,null,null,null,null,null,null,{"$f":"IFERROR(INDEX(IDRefTable_Proposed[Fixt ID],AD49),\"\")","v":""}]
[null,"TechType","ProductListed",null,"LED Lamp","TLED (Type A)","LED Lamp",0.48,"HeatSource",">5,000 sqft","5,000 - 20,000 sqft","20,000+ sqft","Burnout % Threshold","% Incentive Reduction","SalesTaxRates ","PUD Lighting Page","https://www.snopud.com/save-energy/business/rebates/lighting/",null,"CFL(7W)",7,14,null,null,null,null,null,null,null,null,39,{"$f":"IFERROR(INDEX(IDRefTable_Existing[Fixt ID],AD50),\"\")","v":""},null,null,null,null,null,null,null,null,null,null,{"$f":"IFERROR(INDEX(IDRefTable_Proposed[Fixt ID],AD50),\"\")","v":""}]
[null,"LEDL","Yes",null,"LED Kit","TLED (Type B/C)","TLED (Type A)",null,"None",1,1,1,0,0,7.8E-2,"PUD Lighting Contractors","https://www.snopud.com/contractor-network/directory/category/lighting/",null,"CFL(9W)",9,18,null,null,null,null,null,null,null,null,40,{"$f":"IFERROR(INDEX(IDRefTable_Existing[Fixt ID],AD51),\"\")","v":""},null,null,null,null,null,null,null,null,null,null,{"$f":"IFERROR(INDEX(IDRefTable_Proposed[Fixt ID],AD51),\"\")","v":""}]
[null,null,"No",null,"LED Fixture","LED Components","TLED (Type B/C)",null,"Exterior",1,1,1,0.1,0.1,8.4000000000000005E-2,"IRS W9","https://www.irs.gov/pub/irs-pdf/fw9.pdf",null,"CFL(10W)",10,20,null,null,null,null,null,null,null,null,41,{"$f":"IFERROR(INDEX(IDRefTable_Existing[Fixt ID],AD52),\"\")","v":""},null,null,null,null,null,null,null,null,null,null,{"$f":"IFERROR(INDEX(IDRefTable_Proposed[Fixt ID],AD52),\"\")","v":""}]
[null,"LEDFixt","Yes",null,"-----","LED Kit","LED Components",null,"Electric",0.82,0.88,0.94,0.2,0.15,8.6999999999999994E-2,"NXT Level Training","https://nxtleveltraining.com/",null,"CFL(11W)",11,22,null,null,null,null,null,null,null,null,42,{"$f":"IFERROR(INDEX(IDRefTable_Existing[Fixt ID],AD53),\"\")","v":""},null,null,null,null,null,null,null,null,null,null,{"$f":"IFERROR(INDEX(IDRefTable_Proposed[Fixt ID],AD53),\"\")","v":""}]
[null,null,"No",null,"**Fixture Removal Only**","LED Fixture","LED Kit",null,"Gas",1,1,1,0.3,0.2,0.09,"Design Lights Consortium","https://www.designlights.org/",null,"CFL(13W)",13,26,null,null,null,null,null,null,null,null,43,{"$f":"IFERROR(INDEX(IDRefTable_Existing[Fixt ID],AD54),\"\")","v":""},null,null,null,null,null,null,null,null,null,null,{"$f":"IFERROR(INDEX(IDRefTable_Proposed[Fixt ID],AD54),\"\")","v":""}]
[null,null,null,null,"**Lighting Controls Only**","-----","LED Fixture",null,"Oil",1,1,1,0.4,0.25,9.1999999999999998E-2,null,null,null,"CFL(14W)",14,28,null,null,null,null,null,null,null,null,44,{"$f":"IFERROR(INDEX(IDRefTable_Existing[Fixt ID],AD55),\"\")","v":""},null,null,null,null,null,null,null,null,null,null,{"$f":"IFERROR(INDEX(IDRefTable_Proposed[Fixt ID],AD55),\"\")","v":""}]
[null,"RetrofitType","RetrofitTypeLookup",null,"**Existing to Remain**","**Fixture Removal Only**","Exit Sign",null,"Propane",1,1,1,0.5,0.3,9.2999999999999999E-2,null,null,null,"CFL(15W)",15,{"$f":"T56*2","v":30},null,null,null,null,null,null,null,null,45,{"$f":"IFERROR(INDEX(IDRefTable_Existing[Fixt ID],AD56),\"\")","v":""},null,null,null,null,null,null,null,null,null,null,{"$f":"IFERROR(INDEX(IDRefTable_Proposed[Fixt ID],AD56),\"\")","v":""}]
[null,"L","L",null,null,"**Lighting Controls Only**",null,null,"HP - Electric",0.91,0.94,0.97,null,null,9.8000000000000004E-2,null,null,null,"CFL(16W)",16,{"$f":"T57*2","v":32},null,null,null,null,null,null,null,null,46,{"$f":"IFERROR(INDEX(IDRefTable_Existing[Fixt ID],AD57),\"\")","v":""},null,null,null,null,null,null,null,null,null,null,{"$f":"IFERROR(INDEX(IDRefTable_Proposed[Fixt ID],AD57),\"\")","v":""}]
[null,"L-SI","L",null,null,"**Existing to Remain**",null,null,"HP - Gas",0.91,0.94,0.97,null,null,0.104,null,null,null,"CFL(18W)",18,36,null,null,null,null,null,null,null,null,47,{"$f":"IFERROR(INDEX(IDRefTable_Existing[Fixt ID],AD58),\"\")","v":""},null,null,null,null,null,null,null,null,null,null,{"$f":"IFERROR(INDEX(IDRefTable_Proposed[Fixt ID],AD58),\"\")","v":""}]
[null,"TLED-L","L",null,null,null,null,null,"VRF",0.91,0.94,0.97,null,null,0.105,null,null,null,"CFL(19W)",19,38,null,null,null,null,null,null,null,null,48,{"$f":"IFERROR(INDEX(IDRefTable_Existing[Fixt ID],AD59),\"\")","v":""},null,null,null,null,null,null,null,null,null,null,{"$f":"IFERROR(INDEX(IDRefTable_Proposed[Fixt ID],AD59),\"\")","v":""}]
[null,"L-LEDT5","L",null,null,null,null,null,null,null,null,null,null,null,"Tax Exempt",null,null,null,"CFL(20W)",20,40,null,null,null,null,null,null,null,null,49,{"$f":"IFERROR(INDEX(IDRefTable_Existing[Fixt ID],AD60),\"\")","v":""},null,null,null,null,null,null,null,null,null,null,{"$f":"IFERROR(INDEX(IDRefTable_Proposed[Fixt ID],AD60),\"\")","v":""}]
[null,"L-HID","L",null,null,null,null,null,null,null,null,null,null,null,null,null,null,null,"CFL(23W)",23,46,null,null,null,null,null,null,null,null,50,{"$f":"IFERROR(INDEX(IDRefTable_Existing[Fixt ID],AD61),\"\")","v":""},null,null,null,null,null,null,null,null,null,null,{"$f":"IFERROR(INDEX(IDRefTable_Proposed[Fixt ID],AD61),\"\")","v":""}]
[null,"L&D-LEDT8","LD",null,null,null,null,"Fixt ID UserForm Fixt Type","FixtID UserForm Lamps/Fixt",null,"Rebate Type Code","Description",null,null,null,null,null,null,"CFL(26W)",26,52,null,null,null,null,null,null,null,null,51,{"$f":"IFERROR(INDEX(IDRefTable_Existing[Fixt ID],AD62),\"\")","v":""},null,null,null,null,null,null,null,null,null,null,{"$f":"IFERROR(INDEX(IDRefTable_Proposed[Fixt ID],AD62),\"\")","v":""}]
[null,"L&D-LEDT5","LD",null,null,null,null,"[Use Existing Type]","[Use Existing]",null,"L","D. Linear Lighting T8",null,null,null,null,null,null,"CFL(30W)",30,60,null,null,null,null,null,null,null,null,52,{"$f":"IFERROR(INDEX(IDRefTable_Existing[Fixt ID],AD63),\"\")","v":""},null,null,null,null,null,null,null,null,null,null,{"$f":"IFERROR(INDEX(IDRefTable_Proposed[Fixt ID],AD63),\"\")","v":""}]
[null,"TLED-L&D","LD",null,null,null,null,"Can",1,null,"4'T12-L","B. Linear Lighting 4'T12",null,null,null,null,null,null,"CFL(32W)",32,64,null,null,null,null,null,null,null,null,53,{"$f":"IFERROR(INDEX(IDRefTable_Existing[Fixt ID],AD64),\"\")","v":""},null,null,null,null,null,null,null,null,null,null,{"$f":"IFERROR(INDEX(IDRefTable_Proposed[Fixt ID],AD64),\"\")","v":""}]
[null,"Kit","K",null,null,null,null,"Exit Sign",2,null,"8'T12-L","C. Linear Lighting 8'T12",null,null,null,null,null,null,"CFL(36W)",36,72,null,null,null,null,null,null,null,null,54,{"$f":"IFERROR(INDEX(IDRefTable_Existing[Fixt ID],AD65),\"\")","v":""},null,null,null,null,null,null,null,null,null,null,{"$f":"IFERROR(INDEX(IDRefTable_Proposed[Fixt ID],AD65),\"\")","v":""}]
[null,"NF","F",null,null,null,null,"High-Bay",3,null,"H","E. HID Lighting",null,null,null,null,null,null,"CFL(40W)",40,80,null,null,null,null,null,null,null,null,55,{"$f":"IFERROR(INDEX(IDRefTable_Existing[Fixt ID],AD66),\"\")","v":""},null,null,null,null,null,null,null,null,null,null,{"$f":"IFERROR(INDEX(IDRefTable_Proposed[Fixt ID],AD66),\"\")","v":""}]
[null,null,null,null,null,null,null,"Low-Bay",4,null,"N","A. Non-Linear Lighting",null,null,null,null,null,null,"CFL(42W)",42,84,null,null,null,null,null,null,null,null,56,{"$f":"IFERROR(INDEX(IDRefTable_Existing[Fixt ID],AD67),\"\")","v":""},null,null,null,null,null,null,null,null,null,null,{"$f":"IFERROR(INDEX(IDRefTable_Proposed[Fixt ID],AD67),\"\")","v":""}]
[null,"LTGControlType","ControlsSavings","ControlsTypeCode","ExteriorLTGControlType","Control Strategy Types",null,"Pendant",5,null,"E","G. Exit Signs",null,null,null,null,null,null,"CFL(55W)",55,110,null,null,null,null,null,null,null,null,57,{"$f":"IFERROR(INDEX(IDRefTable_Existing[Fixt ID],AD68),\"\")","v":""},null,null,null,null,null,null,null,null,null,null,{"$f":"IFERROR(INDEX(IDRefTable_Proposed[Fixt ID],AD68),\"\")","v":""}]
[null,"N/A",null,null,"N/A","H",null,"Recessed",6,null,"O","F. Other Lighting",null,"Input",0.25,null,null,null,"CFL(60W)",60,120,null,null,null,null,null,null,null,null,58,{"$f":"IFERROR(INDEX(IDRefTable_Existing[Fixt ID],AD69),\"\")","v":""},null,null,null,null,null,null,null,null,null,null,{"$f":"IFERROR(INDEX(IDRefTable_Proposed[Fixt ID],AD69),\"\")","v":""}]
[null,"Occ",0.25,"C","Occ","E",null,"Sconce",7,null,"S","G. Specialty Lighting",null,"Incentive Reduction",{"$f":"VLOOKUP(ROUNDDOWN(O69,1),BurnoutReductionTable,2,TRUE)","v":0.15},null,null,null,"CFL(65W)",65,130,null,null,null,null,null,null,null,null,59,{"$f":"IFERROR(INDEX(IDRefTable_Existing[Fixt ID],AD70),\"\")","v":""},null,null,null,null,null,null,null,null,null,null,{"$f":"IFERROR(INDEX(IDRefTable_Proposed[Fixt ID],AD70),\"\")","v":""}]
[null,"Day",0.25,"C","Network","P",null,"Strip",8,null,null,null,null,null,null,null,null,null,"CFL(80W)",80,160,null,null,null,null,null,null,null,null,60,{"$f":"IFERROR(INDEX(IDRefTable_Existing[Fixt ID],AD71),\"\")","v":""},null,null,null,null,null,null,null,null,null,null,{"$f":"IFERROR(INDEX(IDRefTable_Proposed[Fixt ID],AD71),\"\")","v":""}]
[null,"Combo",0.35,"CA",null,"O",null,"Surface","N/A",null,"Specialty Incentive Rates",null,null,null,null,null,null,null,"CFL(85W)",85,170,null,null,null,null,null,null,null,null,61,{"$f":"IFERROR(INDEX(IDRefTable_Existing[Fixt ID],AD72),\"\")","v":""},null,null,null,null,null,null,null,null,null,null,{"$f":"IFERROR(INDEX(IDRefTable_Proposed[Fixt ID],AD72),\"\")","v":""}]
[null,"Network",0.45,"CN",null,"D",null,"Stairwell",null,null,"RetroType/Hours","Incentive Rate ($/kWh)",null,null,null,null,null,null,"CFL(100W)",100,200,null,null,null,null,null,null,null,null,62,{"$f":"IFERROR(INDEX(IDRefTable_Existing[Fixt ID],AD73),\"\")","v":""},null,null,null,null,null,null,null,null,null,null,{"$f":"IFERROR(INDEX(IDRefTable_Proposed[Fixt ID],AD73),\"\")","v":""}]
[null,"LLLC",0.45,"CL",null,"S",null,"Track",null,null,"LT1",0.18,null,null,null,null,null,null,"CFL(105W)",105,210,null,null,null,null,null,null,null,null,63,{"$f":"IFERROR(INDEX(IDRefTable_Existing[Fixt ID],AD74),\"\")","v":""},null,null,null,null,null,null,null,null,null,null,{"$f":"IFERROR(INDEX(IDRefTable_Proposed[Fixt ID],AD74),\"\")","v":""}]
[null,"ErrorCheckingTable","LIF Message","LRW Message",null,"X",null,"Troffer",null,null,"LT2",0.14000000000000001,null,null,null,null,null,null,"CFL(150W)",150,300,null,null,null,null,null,null,null,null,64,{"$f":"IFERROR(INDEX(IDRefTable_Existing[Fixt ID],AD75),\"\")","v":""},null,null,null,null,null,null,null,null,null,null,{"$f":"IFERROR(INDEX(IDRefTable_Proposed[Fixt ID],AD75),\"\")","v":""}]
[null,"ER1","Heat Source?","Heat?",null,null,null,"Wrap",null,null,"LT3",0.11,null,null,null,null,null,null,"CFL(180W)",180,360,null,null,null,null,null,null,null,null,65,{"$f":"IFERROR(INDEX(IDRefTable_Existing[Fixt ID],AD76),\"\")","v":""},null,null,null,null,null,null,null,null,null,null,{"$f":"IFERROR(INDEX(IDRefTable_Proposed[Fixt ID],AD76),\"\")","v":""}]
[null,"ER2","Hours/Yr?","Hours?",null,null,null,"Wall Wash",null,null,"KT1",0.32,null,null,null,null,null,null,"CFL(200W)",200,400,null,null,null,null,null,null,null,null,66,{"$f":"IFERROR(INDEX(IDRefTable_Existing[Fixt ID],AD77),\"\")","v":""},null,null,null,null,null,null,null,null,null,null,{"$f":"IFERROR(INDEX(IDRefTable_Proposed[Fixt ID],AD77),\"\")","v":""}]
[null,"ER3","# of Fixtures?","# of Fixt?",null,null,null,"--",null,null,"KT2",0.25,null,null,null,null,null,null,"CFFixt(13W)ES-Mag",17,30,null,null,null,null,null,null,null,null,{"$f":"AD77+1","v":67},{"$f":"IFERROR(INDEX(IDRefTable_Existing[Fixt ID],AD78),\"\")","v":""},null,null,null,null,null,null,null,null,null,null,{"$f":"IFERROR(INDEX(IDRefTable_Proposed[Fixt ID],AD78),\"\")","v":""}]
[null,"ER4","TLED's Only for T5/T8/ T12s","Lin Lamp Err",null,null,null,"Flood",null,null,"KT3",0.18,null,null,null,null,null,null,"CFFixt(18W)ES-Mag",24,41,null,null,null,null,null,null,null,null,68,{"$f":"IFERROR(INDEX(IDRefTable_Existing[Fixt ID],AD79),\"\")","v":""},null,null,null,null,null,null,null,null,null,null,{"$f":"IFERROR(INDEX(IDRefTable_Proposed[Fixt ID],AD79),\"\")","v":""}]
[null,"ER5","Check Wattage Reduction","Wattage Reduction",null,null,null,"Landscape",null,null,"FT1",0.35,null,null,null,null,null,null,"CFFixt(26W)ES-Mag",34,60,null,null,null,null,null,null,null,null,69,{"$f":"IFERROR(INDEX(IDRefTable_Existing[Fixt ID],AD80),\"\")","v":""},null,null,null,null,null,null,null,null,null,null,{"$f":"IFERROR(INDEX(IDRefTable_Proposed[Fixt ID],AD80),\"\")","v":""}]
[null,"ER6","Product Qualified?","Qualified?",null,null,null,"Pole",null,null,"FT2",0.28000000000000003,null,null,null,null,null,null,"CFFixt(32W)ES-Mag",42,74,null,null,null,null,null,null,null,null,70,{"$f":"IFERROR(INDEX(IDRefTable_Existing[Fixt ID],AD81),\"\")","v":""},null,null,null,null,null,null,null,null,null,null,{"$f":"IFERROR(INDEX(IDRefTable_Proposed[Fixt ID],AD81),\"\")","v":""}]
[null,"ER7","Product Not Eligible","Not Eligible",null,null,null,"Soffit",null,null,"FT3",0.2,null,null,null,null,null,null,"CFFixt(42W)ES-Mag",55,100,null,null,null,null,null,null,null,null,71,{"$f":"IFERROR(INDEX(IDRefTable_Existing[Fixt ID],AD82),\"\")","v":""},null,null,null,null,null,null,null,null,null,null,{"$f":"IFERROR(INDEX(IDRefTable_Proposed[Fixt ID],AD82),\"\")","v":""}]
[null,"ER8","Controls?","Controls?",null,null,null,"Wall Pack",null,null,null,null,null,null,null,null,null,null,"CFFixt(5W)ES-Mag",7,12,null,null,null,null,null,null,null,null,72,{"$f":"IFERROR(INDEX(IDRefTable_Existing[Fixt ID],AD83),\"\")","v":""},null,null,null,null,null,null,null,null,null,null,{"$f":"IFERROR(INDEX(IDRefTable_Proposed[Fixt ID],AD83),\"\")","v":""}]
[null,"ER9","# of Sensors?","# of Sens?",null,null,null,"Other",null,null,null,null,null,null,null,null,null,null,"CFFixt(7W)ES-Mag",9,17,null,null,null,null,null,null,null,null,73,{"$f":"IFERROR(INDEX(IDRefTable_Existing[Fixt ID],AD84),\"\")","v":""},null,null,null,null,null,null,null,null,null,null,{"$f":"IFERROR(INDEX(IDRefTable_Proposed[Fixt ID],AD84),\"\")","v":""}]
[null,"ER10","LED Lamps for HID Only","Lamps HID Only",null,null,"Historic Incentive Rates",null,null,null,null,null,null,null,null,null,null,null,"CFFixt(9W)ES-Mag",12,21,null,null,null,null,null,null,null,null,74,{"$f":"IFERROR(INDEX(IDRefTable_Existing[Fixt ID],AD85),\"\")","v":""},null,null,null,null,null,null,null,null,null,null,{"$f":"IFERROR(INDEX(IDRefTable_Proposed[Fixt ID],AD85),\"\")","v":""}]
[null,"X","For Reference Only","Reference",null,null,"Rate Name","PDI - Base","PDI - Base w/ NXT LVL","PDI - Networked Cont","PDI - LLLCs",null,null,null,null,null,null,null,"CFFixt(24W)ES-Mag",31,56,null,null,null,null,null,null,null,null,75,{"$f":"IFERROR(INDEX(IDRefTable_Existing[Fixt ID],AD86),\"\")","v":""},null,null,null,null,null,null,null,null,null,null,{"$f":"IFERROR(INDEX(IDRefTable_Proposed[Fixt ID],AD86),\"\")","v":""}]
[null,"ER12","High End Trim Required","Hi Trim Req",null,null,2025,0.02,{"$f":"H87+0.005","v":2.5000000000000001E-2},0.01,1.4999999999999999E-2,null,null,null,null,null,null,null,"CFFixt(25W)ES-Mag",33,58,null,null,null,null,null,null,null,null,76,{"$f":"IFERROR(INDEX(IDRefTable_Existing[Fixt ID],AD87),\"\")","v":""},null,null,null,null,null,null,null,null,null,null,{"$f":"IFERROR(INDEX(IDRefTable_Proposed[Fixt ID],AD87),\"\")","v":""}]
[null,"ER13","Enter Control Strategy","Control Strategy?",null,null,2024,0.02,{"$f":"H88+0.005","v":2.5000000000000001E-2},0.01,1.4999999999999999E-2,null,null,null,null,null,null,null,"CFFixt(27W)ES-Mag",35,63,null,null,null,null,null,null,null,null,77,{"$f":"IFERROR(INDEX(IDRefTable_Existing[Fixt ID],AD88),\"\")","v":""},null,null,null,null,null,null,null,null,null,null,{"$f":"IFERROR(INDEX(IDRefTable_Proposed[Fixt ID],AD88),\"\")","v":""}]
[null,"ER14","Existing Technology Inelligible","Not Eligible",null,null,2023,0.01,1.2500000000000001E-2,0.01,1.4999999999999999E-2,null,null,null,null,null,null,null,"CFFixt(28W)ES-Mag",37,65,null,null,null,null,null,null,null,null,78,{"$f":"IFERROR(INDEX(IDRefTable_Existing[Fixt ID],AD89),\"\")","v":""},null,null,null,null,null,null,null,null,null,null,{"$f":"IFERROR(INDEX(IDRefTable_Proposed[Fixt ID],AD89),\"\")","v":""}]
[null,"ER15",null,null,null,null,2022,0.01,1.2500000000000001E-2,0.01,0.01,null,null,null,null,null,null,null,"CFFixt(36W)ES-Mag",47,83,null,null,null,null,null,null,null,null,79,{"$f":"IFERROR(INDEX(IDRefTable_Existing[Fixt ID],AD90),\"\")","v":""},null,null,null,null,null,null,null,null,null,null,{"$f":"IFERROR(INDEX(IDRefTable_Proposed[Fixt ID],AD90),\"\")","v":""}]
[null,"C","Controls (See Below)","Controls",null,null,null,null,null,null,null,null,null,null,null,null,null,null,"CFFixt(40W)ES-Mag",52,92,null,null,null,null,null,null,null,null,80,{"$f":"IFERROR(INDEX(IDRefTable_Existing[Fixt ID],AD91),\"\")","v":""},null,null,null,null,null,null,null,null,null,null,{"$f":"IFERROR(INDEX(IDRefTable_Proposed[Fixt ID],AD91),\"\")","v":""}]
[null,null,null,null,null,null,"Compatibale Import Versions","Default Incentive Rate",null,"Active Incentive Rate",null,null,null,null,null,null,null,null,"CFFixt(50W)ES-Mag",65,115,null,null,null,null,null,null,null,null,81,{"$f":"IFERROR(INDEX(IDRefTable_Existing[Fixt ID],AD92),\"\")","v":""},null,null,null,null,null,null,null,null,null,null,{"$f":"IFERROR(INDEX(IDRefTable_Proposed[Fixt ID],AD92),\"\")","v":""}]
[null,null,null,null,null,null,"Version April 2020 - Effective Date April 2nd, 2020",2022,null,{"$f":"IF(IncentiveRateChoice=\"\",OFFSET(IncentiveRateDefault,MATCH(Version,OldVersions,0),0),IncentiveRateChoice)","v":2025},null,null,null,null,null,null,null,null,"CFFixt(55W)ES-Mag",72,127,null,null,null,null,null,null,null,null,82,{"$f":"IFERROR(INDEX(IDRefTable_Existing[Fixt ID],AD93),\"\")","v":""},null,null,null,null,null,null,null,null,null,null,{"$f":"IFERROR(INDEX(IDRefTable_Proposed[Fixt ID],AD93),\"\")","v":""}]
[null,"Pay Letter Opportunities",null,"Status Flags",null,null,"Version Sept 2020 - Effective Date September 1st, 2020",2022,null,null,null,null,null,null,null,null,null,null,"CFFixt(57W)ES-Mag",74,132,null,null,null,null,null,null,null,null,83,{"$f":"IFERROR(INDEX(IDRefTable_Existing[Fixt ID],AD94),\"\")","v":""},null,null,null,null,null,null,null,null,null,null,{"$f":"IFERROR(INDEX(IDRefTable_Proposed[Fixt ID],AD94),\"\")","v":""}]
[null,null,null,"Proj Dev Incentive to Cust",{"$f":"ISNUMBER(FIND(\"Customer\",App_PDIRecipient,1))","v":true},null,"Version Jan 2021 - Effective Date January 1st, 2021",2022,null,null,null,null,null,null,null,null,null,null,"CFFixt(70W)ES-Mag",91,161,null,null,null,null,null,null,null,null,84,{"$f":"IFERROR(INDEX(IDRefTable_Existing[Fixt ID],AD95),\"\")","v":""},null,null,null,null,null,null,null,null,null,null,{"$f":"IFERROR(INDEX(IDRefTable_Proposed[Fixt ID],AD95),\"\")","v":""}]
[null,"Advanced Rooftop Controls",null,"NXT Level Contractor",false,null,"Version August 2021 - Effective Date August 1st, 2021",2022,null,null,null,null,null,null,null,null,null,null,"CFFixt(80W)ES-Mag",104,184,null,null,null,null,null,null,null,null,85,{"$f":"IFERROR(INDEX(IDRefTable_Existing[Fixt ID],AD96),\"\")","v":""},null,null,null,null,null,null,null,null,null,null,{"$f":"IFERROR(INDEX(IDRefTable_Proposed[Fixt ID],AD96),\"\")","v":""}]
[null,"Building Controls",null,"Auto Highlight AsBuilt",true,null,"Version Dec 2021 - Effective Date December 1st, 2021",2022,null,null,null,null,null,null,null,null,null,null,"CFFixt(13W)Elect",16,29,null,null,null,null,null,null,null,null,86,{"$f":"IFERROR(INDEX(IDRefTable_Existing[Fixt ID],AD97),\"\")","v":""},null,null,null,null,null,null,null,null,null,null,{"$f":"IFERROR(INDEX(IDRefTable_Proposed[Fixt ID],AD97),\"\")","v":""}]
[null,"Commercial Kitchen Equipment",null,"Edit Mode",false,null,"Version May 2022 - Effective Date May 1st, 2022",2022,null,null,null,null,null,null,null,null,null,null,"CFFixt(18W)Elect",19,38,null,null,null,null,null,null,null,null,87,{"$f":"IFERROR(INDEX(IDRefTable_Existing[Fixt ID],AD98),\"\")","v":""},null,null,null,null,null,null,null,null,null,null,{"$f":"IFERROR(INDEX(IDRefTable_Proposed[Fixt ID],AD98),\"\")","v":""}]
[null,"Compressed Air",null,"Loading Bar Mode",1,null,"Version July 2022 - Effective Date July 1st, 2022",2022,null,null,null,null,null,null,null,null,null,null,"CFFixt(26W)Elect",27,54,null,null,null,null,null,null,null,null,88,{"$f":"IFERROR(INDEX(IDRefTable_Existing[Fixt ID],AD99),\"\")","v":""},null,null,null,null,null,null,null,null,null,null,{"$f":"IFERROR(INDEX(IDRefTable_Proposed[Fixt ID],AD99),\"\")","v":""}]
[null,"Connected Thermostats",null,"Import File Path",null,null,"Version Sept 2022 - Effective Date September 1st, 2022",2022,null,null,null,null,null,null,null,null,null,null,"CFFixt(32W)Elect",33,68,null,null,null,null,null,null,null,null,89,{"$f":"IFERROR(INDEX(IDRefTable_Existing[Fixt ID],AD100),\"\")","v":""},null,null,null,null,null,null,null,null,null,null,{"$f":"IFERROR(INDEX(IDRefTable_Proposed[Fixt ID],AD100),\"\")","v":""}]
[null,"Demand Control Kitchen Ventilation",null,"Import Success",null,null,"Version Dec 2022 - Effective Date December 1st, 2022",2023,null,null,null,null,null,null,null,null,null,null,"CFFixt(42W)Elect",43,93,null,null,null,null,null,null,null,null,90,{"$f":"IFERROR(INDEX(IDRefTable_Existing[Fixt ID],AD101),\"\")","v":""},null,null,null,null,null,null,null,null,null,null,{"$f":"IFERROR(INDEX(IDRefTable_Proposed[Fixt ID],AD101),\"\")","v":""}]
[null,"Engine Block Heaters",null,"Macros Enabled",true,null,"Version January 2023 - Effective Date January 1st, 2023",2023,null,null,null,null,null,null,null,null,null,null,"CFFixt(5W)Elect",5,11,null,null,null,null,null,null,null,null,91,{"$f":"IFERROR(INDEX(IDRefTable_Existing[Fixt ID],AD102),\"\")","v":""},null,null,null,null,null,null,null,null,null,null,{"$f":"IFERROR(INDEX(IDRefTable_Proposed[Fixt ID],AD102),\"\")","v":""}]
[null,"Heat Pumps (including ductless)",null,"Stuff Enabled",true,null,"Version February 2023 - Effective Date February 1st, 2023",2023,null,null,null,null,null,null,null,null,null,null,"CFFixt(7W)Elect",7,15,null,null,null,null,null,null,null,null,92,{"$f":"IFERROR(INDEX(IDRefTable_Existing[Fixt ID],AD103),\"\")","v":""},null,null,null,null,null,null,null,null,null,null,{"$f":"IFERROR(INDEX(IDRefTable_Proposed[Fixt ID],AD103),\"\")","v":""}]
[null,"Insulation & Windows (electrically heated facility only)",null,null,null,null,"Version March 2023 - Effective Date March 1st, 2023",2023,null,null,null,null,null,null,null,null,null,null,"CFFixt(9W)Elect",10,19,null,null,null,null,null,null,null,null,93,{"$f":"IFERROR(INDEX(IDRefTable_Existing[Fixt ID],AD104),\"\")","v":""},null,null,null,null,null,null,null,null,null,null,{"$f":"IFERROR(INDEX(IDRefTable_Proposed[Fixt ID],AD104),\"\")","v":""}]
[null,"Lighting",null,null,null,null,"Version April 2023 - Effective Date April 1st, 2023",2023,null,null,null,null,null,null,null,null,null,null,"CFFixt(24W)Elect",25,50,null,null,null,null,null,null,null,null,94,{"$f":"IFERROR(INDEX(IDRefTable_Existing[Fixt ID],AD105),\"\")","v":""},null,null,null,null,null,null,null,null,null,null,{"$f":"IFERROR(INDEX(IDRefTable_Proposed[Fixt ID],AD105),\"\")","v":""}]
[null,"Lighting Controls",null,null,null,null,"Version August 2023 - Effective Date August 1st, 2023",2023,null,null,null,null,null,null,null,null,null,null,"CFFixt(25W)Elect",26,52,null,null,null,null,null,null,null,null,95,{"$f":"IFERROR(INDEX(IDRefTable_Existing[Fixt ID],AD106),\"\")","v":""},null,null,null,null,null,null,null,null,null,null,{"$f":"IFERROR(INDEX(IDRefTable_Proposed[Fixt ID],AD106),\"\")","v":""}]
[null,"Refrigeration",null,null,null,null,"Version December 2023 - Effective Date December 1st, 2023",2024,null,null,null,null,null,null,null,null,null,null,"CFFixt(27W)Elect",29,56,null,null,null,null,null,null,null,null,96,{"$f":"IFERROR(INDEX(IDRefTable_Existing[Fixt ID],AD107),\"\")","v":""},null,null,null,null,null,null,null,null,null,null,{"$f":"IFERROR(INDEX(IDRefTable_Proposed[Fixt ID],AD107),\"\")","v":""}]
[null,"Variable Speed Drive",null,null,null,null,"Version April 2024 - Effective Date April 1st, 2024",2024,null,null,null,null,null,null,null,null,null,null,"CFFixt(28W)Elect",30,58,null,null,null,null,null,null,null,null,97,{"$f":"IFERROR(INDEX(IDRefTable_Existing[Fixt ID],AD108),\"\")","v":""},null,null,null,null,null,null,null,null,null,null,{"$f":"IFERROR(INDEX(IDRefTable_Proposed[Fixt ID],AD108),\"\")","v":""}]
[null,"Ventilation & Air Conditioning",null,null,null,null,"Version May 2024 - Effective Date May 1st, 2024",2024,null,null,null,null,null,null,null,null,null,null,"CFFixt(36W)Elect",38,74,null,null,null,null,null,null,null,null,98,{"$f":"IFERROR(INDEX(IDRefTable_Existing[Fixt ID],AD109),\"\")","v":""},null,null,null,null,null,null,null,null,null,null,{"$f":"IFERROR(INDEX(IDRefTable_Proposed[Fixt ID],AD109),\"\")","v":""}]
[null,"Water Heating",null,null,null,null,"Version June 2024 - Effective Date June 1st, 2024",2024,null,null,null,null,null,null,null,null,null,null,"CFFixt(40W)Elect",42,82,null,null,null,null,null,null,null,null,99,{"$f":"IFERROR(INDEX(IDRefTable_Existing[Fixt ID],AD110),\"\")","v":""},null,null,null,null,null,null,null,null,null,null,{"$f":"IFERROR(INDEX(IDRefTable_Proposed[Fixt ID],AD110),\"\")","v":""}]
[null,null,null,null,null,null,"Version December 2024 - Effective Date December 1st, 2024",2024,null,null,null,null,null,null,null,null,null,null,"CFFixt(50W)Elect",53,103,null,null,null,null,null,null,null,null,100,{"$f":"IFERROR(INDEX(IDRefTable_Existing[Fixt ID],AD111),\"\")","v":""},null,null,null,null,null,null,null,null,null,null,{"$f":"IFERROR(INDEX(IDRefTable_Proposed[Fixt ID],AD111),\"\")","v":""}]
[null,"As-Built File Paths",null,null,null,null,{"$f":"Version","v":"Version April 2025 - Effective Date April 1st, 2025"},2025,null,null,null,null,null,null,null,null,null,null,"CFFixt(55W)Elect",58,113,null,null,null,null,null,null,null,null,101,{"$f":"IFERROR(INDEX(IDRefTable_Existing[Fixt ID],AD112),\"\")","v":""},null,null,null,null,null,null,null,null,null,null,{"$f":"IFERROR(INDEX(IDRefTable_Proposed[Fixt ID],AD112),\"\")","v":""}]
[null,"File Name","File Path",null,"Pay Letter Contact Info",null,null,null,null,null,null,null,null,null,null,null,null,null,"CFFixt(57W)Elect",60,117,null,null,null,null,null,null,null,null,102,{"$f":"IFERROR(INDEX(IDRefTable_Existing[Fixt ID],AD113),\"\")","v":""},null,null,null,null,null,null,null,null,null,null,{"$f":"IFERROR(INDEX(IDRefTable_Proposed[Fixt ID],AD113),\"\")","v":""}]
[null,"Signed Participation Agreement",null,null,"Engineer","Title","Phone","Email",null,null,null,null,null,null,null,null,null,null,"CFFixt(70W)Elect",74,144,null,null,null,null,null,null,null,null,103,{"$f":"IFERROR(INDEX(IDRefTable_Existing[Fixt ID],AD114),\"\")","v":""},null,null,null,null,null,null,null,null,null,null,{"$f":"IFERROR(INDEX(IDRefTable_Proposed[Fixt ID],AD114),\"\")","v":""}]
[null,"Final Invoice",null,null,"Allison Grinczel","Energy Management Engineer",4257838275,"aagrinczel@snopud.com",null,null,null,null,null,null,null,null,null,null,"CFFixt(80W)Elect",85,164,null,null,null,null,null,null,null,null,104,{"$f":"IFERROR(INDEX(IDRefTable_Existing[Fixt ID],AD115),\"\")","v":""},null,null,null,null,null,null,null,null,null,null,{"$f":"IFERROR(INDEX(IDRefTable_Proposed[Fixt ID],AD115),\"\")","v":""}]
[null,"As-Built Spec Sheets",null,null,"Rob Marks","Senior Energy Management Engineer",4257838169,"rlmarks@snopud.com",null,null,null,null,null,null,null,null,null,null,"LF2ftT12(20W)All",24,51,77,102,null,null,null,null,null,null,105,{"$f":"IFERROR(INDEX(IDRefTable_Existing[Fixt ID],AD116),\"\")","v":""},null,null,null,null,null,null,null,null,null,null,{"$f":"IFERROR(INDEX(IDRefTable_Proposed[Fixt ID],AD116),\"\")","v":""}]
[null,"Pictures",null,null,"Rick Rosenkilde","Energy Management Engineer",4257831743,"rrrosenkilde@snopud.com",null,null,null,null,null,null,null,null,null,null,"LF4ftT12(34W-40W)All",48,82,130,164,null,260,null,null,null,null,106,{"$f":"IFERROR(INDEX(IDRefTable_Existing[Fixt ID],AD117),\"\")","v":""},null,null,null,null,null,null,null,null,null,null,{"$f":"IFERROR(INDEX(IDRefTable_Proposed[Fixt ID],AD117),\"\")","v":""}]
[null,"Misc 1.",null,null,"Orion Eaton","Energy Management Engineer",4257258845,"ojeaton@snopud.com",null,null,null,null,null,null,null,null,null,null,"LF8ftT12(60W-75W)All",83,138,220,246,null,null,null,null,null,null,107,{"$f":"IFERROR(INDEX(IDRefTable_Existing[Fixt ID],AD118),\"\")","v":""},null,null,null,null,null,null,null,null,null,null,{"$f":"IFERROR(INDEX(IDRefTable_Proposed[Fixt ID],AD118),\"\")","v":""}]
[null,"Misc 2.",null,null,"Ian Tachibana","Energy Management Engineer",4255507670,"IPTachibana@Snopud.com",null,null,null,null,null,null,null,null,null,null,"LF8ftT12(95W-110W)All",125,227,352,416,null,null,null,null,null,null,108,{"$f":"IFERROR(INDEX(IDRefTable_Existing[Fixt ID],AD119),\"\")","v":""},null,null,null,null,null,null,null,null,null,null,{"$f":"IFERROR(INDEX(IDRefTable_Proposed[Fixt ID],AD119),\"\")","v":""}]
[null,null,null,null,"Emily Kubiak","Energy Management Engineer",4257831700,"EAKubiak@Snopud.com",null,null,null,null,null,null,null,null,null,null,"LF8ftT12(185W-215W)All",200,325,525,650,null,null,null,null,null,null,109,{"$f":"IFERROR(INDEX(IDRefTable_Existing[Fixt ID],AD120),\"\")","v":""},null,null,null,null,null,null,null,null,null,null,{"$f":"IFERROR(INDEX(IDRefTable_Proposed[Fixt ID],AD120),\"\")","v":""}]
[null,null,null,null,"Shayne Moore","Energy Management Engineer",4252970168,"samoore@snopud.com",null,null,null,null,null,null,null,null,null,null,"LF2ftT8(17W)Std-Elect",19,33,52,66,null,104,null,null,null,null,110,{"$f":"IFERROR(INDEX(IDRefTable_Existing[Fixt ID],AD121),\"\")","v":""},null,null,null,null,null,null,null,null,null,null,{"$f":"IFERROR(INDEX(IDRefTable_Proposed[Fixt ID],AD121),\"\")","v":""}]
[null,null,null,null,null,null,null,null,null,null,null,null,null,null,null,null,null,null,"LF2ftT8(17W)LBF",15,27,42,54,null,84,null,null,null,null,111,{"$f":"IFERROR(INDEX(IDRefTable_Existing[Fixt ID],AD122),\"\")","v":""},null,null,null,null,null,null,null,null,null,null,{"$f":"IFERROR(INDEX(IDRefTable_Proposed[Fixt ID],AD122),\"\")","v":""}]
[null,"Application Import Ranges",null,null,null,null,null,null,null,null,null,null,null,null,null,null,null,null,"LF2ftT8(17W)NBF",16,31,47,62,null,94,null,null,null,null,112,{"$f":"IFERROR(INDEX(IDRefTable_Existing[Fixt ID],AD123),\"\")","v":""},null,null,null,null,null,null,null,null,null,null,{"$f":"IFERROR(INDEX(IDRefTable_Proposed[Fixt ID],AD123),\"\")","v":""}]
[null,"Range Name","Old Wkbk Row Ref","Old Wkbk Col Ref",null,null,null,null,null,null,null,null,null,null,null,null,null,null,"LF2ftT8(17W)HBF",22,41,63,82,null,126,null,null,null,null,113,{"$f":"IFERROR(INDEX(IDRefTable_Existing[Fixt ID],AD124),\"\")","v":""},null,null,null,null,null,null,null,null,null,null,{"$f":"IFERROR(INDEX(IDRefTable_Proposed[Fixt ID],AD124),\"\")","v":""}]
[null,"App_FacName",14,4,null,null,null,null,null,null,null,null,null,null,null,null,null,null,"LF2ftT8(40W (Biax))Std-Elect",42,82,124,164,null,248,null,null,null,null,114,{"$f":"IFERROR(INDEX(IDRefTable_Existing[Fixt ID],AD125),\"\")","v":""},null,null,null,null,null,null,null,null,null,null,{"$f":"IFERROR(INDEX(IDRefTable_Proposed[Fixt ID],AD125),\"\")","v":""}]
[null,"App_FacAdd",14,17,null,null,null,null,null,null,null,null,null,null,null,null,null,null,"LF2ftT8(40W (Biax))LBF",39,67,106,134,null,212,null,null,null,null,115,{"$f":"IFERROR(INDEX(IDRefTable_Existing[Fixt ID],AD126),\"\")","v":""},null,null,null,null,null,null,null,null,null,null,{"$f":"IFERROR(INDEX(IDRefTable_Proposed[Fixt ID],AD126),\"\")","v":""}]
[null,"App_FacCity",14,33,null,null,null,null,null,null,null,null,null,null,null,null,null,null,"LF2ftT8(40W (Biax))NBF",41,72,113,144,null,226,null,null,null,null,116,{"$f":"IFERROR(INDEX(IDRefTable_Existing[Fixt ID],AD127),\"\")","v":""},null,null,null,null,null,null,null,null,null,null,{"$f":"IFERROR(INDEX(IDRefTable_Proposed[Fixt ID],AD127),\"\")","v":""}]
[null,"App_FacZip",14,44,null,null,null,null,null,null,null,null,null,null,null,null,null,null,"LF2ftT8(40W (Biax))HBF",50,95,145,190,null,290,null,null,null,null,117,{"$f":"IFERROR(INDEX(IDRefTable_Existing[Fixt ID],AD128),\"\")","v":""},null,null,null,null,null,null,null,null,null,null,{"$f":"IFERROR(INDEX(IDRefTable_Proposed[Fixt ID],AD128),\"\")","v":""}]
[null,"App_PremType",null,null,null,null,null,null,null,null,null,null,null,null,null,null,null,null,"LF2ftT8(55W (Biax))Std-Elect",58,113,171,226,null,342,null,null,null,null,118,{"$f":"IFERROR(INDEX(IDRefTable_Existing[Fixt ID],AD129),\"\")","v":""},null,null,null,null,null,null,null,null,null,null,{"$f":"IFERROR(INDEX(IDRefTable_Proposed[Fixt ID],AD129),\"\")","v":""}]
[null,"App_PremCategory",null,null,null,null,null,null,null,null,null,null,null,null,null,null,null,null,"LF2ftT8(55W (Biax))LBF",56,110,166,220,null,332,null,null,null,null,119,{"$f":"IFERROR(INDEX(IDRefTable_Existing[Fixt ID],AD130),\"\")","v":""},null,null,null,null,null,null,null,null,null,null,{"$f":"IFERROR(INDEX(IDRefTable_Proposed[Fixt ID],AD130),\"\")","v":""}]
[null,"App_PUDAcct",16,15,null,null,null,null,null,null,null,null,null,null,null,null,null,null,"LF2ftT8(55W (Biax))NBF",58,112,170,224,null,340,null,null,null,null,120,{"$f":"IFERROR(INDEX(IDRefTable_Existing[Fixt ID],AD131),\"\")","v":""},null,null,null,null,null,null,null,null,null,null,{"$f":"IFERROR(INDEX(IDRefTable_Proposed[Fixt ID],AD131),\"\")","v":""}]
[null,"App_PUDMeter",16,23,null,null,null,null,null,null,null,null,null,null,null,null,null,null,"LF2ftT8(55W (Biax))HBF",64,123,187,246,null,374,null,null,null,null,121,{"$f":"IFERROR(INDEX(IDRefTable_Existing[Fixt ID],AD132),\"\")","v":""},null,null,null,null,null,null,null,null,null,null,{"$f":"IFERROR(INDEX(IDRefTable_Proposed[Fixt ID],AD132),\"\")","v":""}]
[null,"App_EstkWh",16,31,null,null,null,null,null,null,null,null,null,null,null,null,null,null,"LF4ftT8(25W)Std-Elect",23,46,69,92,null,138,null,184,null,null,122,{"$f":"IFERROR(INDEX(IDRefTable_Existing[Fixt ID],AD133),\"\")","v":""},null,null,null,null,null,null,null,null,null,null,{"$f":"IFERROR(INDEX(IDRefTable_Proposed[Fixt ID],AD133),\"\")","v":""}]
[null,"App_SqFt",16,34,null,null,null,null,null,null,null,null,null,null,null,null,null,null,"LF4ftT8(25W)LBF",20,38,58,76,null,114,null,152,null,null,123,{"$f":"IFERROR(INDEX(IDRefTable_Existing[Fixt ID],AD134),\"\")","v":""},null,null,null,null,null,null,null,null,null,null,{"$f":"IFERROR(INDEX(IDRefTable_Proposed[Fixt ID],AD134),\"\")","v":""}]
[null,"App_MultiTen",16,39,null,null,null,null,null,null,null,null,null,null,null,null,null,null,"LF4ftT8(25W)NBF",22,43,65,86,null,129,null,172,null,null,124,{"$f":"IFERROR(INDEX(IDRefTable_Existing[Fixt ID],AD135),\"\")","v":""},null,null,null,null,null,null,null,null,null,null,{"$f":"IFERROR(INDEX(IDRefTable_Proposed[Fixt ID],AD135),\"\")","v":""}]
[null,"App_AC",16,42,null,null,null,null,null,null,null,null,null,null,null,null,null,null,"LF4ftT8(25W)HBF",30,58,88,116,null,174,null,232,null,null,125,{"$f":"IFERROR(INDEX(IDRefTable_Existing[Fixt ID],AD136),\"\")","v":""},null,null,null,null,null,null,null,null,null,null,{"$f":"IFERROR(INDEX(IDRefTable_Proposed[Fixt ID],AD136),\"\")","v":""}]
[null,"App_HeatSource",16,44,null,null,null,null,null,null,null,null,null,null,null,null,null,null,"LF4ftT8(28W)Std-Elect",26,52,78,104,null,156,null,208,null,null,126,{"$f":"IFERROR(INDEX(IDRefTable_Existing[Fixt ID],AD137),\"\")","v":""},null,null,null,null,null,null,null,null,null,null,{"$f":"IFERROR(INDEX(IDRefTable_Proposed[Fixt ID],AD137),\"\")","v":""}]
[null,"App_Occ1Start",17,12,null,null,null,null,null,null,null,null,null,null,null,null,null,null,"LF4ftT8(28W)LBF",22,42,64,84,null,126,null,168,null,null,127,{"$f":"IFERROR(INDEX(IDRefTable_Existing[Fixt ID],AD138),\"\")","v":""},null,null,null,null,null,null,null,null,null,null,{"$f":"IFERROR(INDEX(IDRefTable_Proposed[Fixt ID],AD138),\"\")","v":""}]
[null,"App_Occ1End",17,14,null,null,null,null,null,null,null,null,null,null,null,null,null,null,"LF4ftT8(28W)NBF",25,48,73,96,null,144,null,192,null,null,128,{"$f":"IFERROR(INDEX(IDRefTable_Existing[Fixt ID],AD139),\"\")","v":""},null,null,null,null,null,null,null,null,null,null,{"$f":"IFERROR(INDEX(IDRefTable_Proposed[Fixt ID],AD139),\"\")","v":""}]
[null,"App_Occ2Start",17,24,null,null,null,null,null,null,null,null,null,null,null,null,null,null,"LF4ftT8(28W)HBF",33,65,98,130,null,195,null,260,null,null,129,{"$f":"IFERROR(INDEX(IDRefTable_Existing[Fixt ID],AD140),\"\")","v":""},null,null,null,null,null,null,null,null,null,null,{"$f":"IFERROR(INDEX(IDRefTable_Proposed[Fixt ID],AD140),\"\")","v":""}]
[null,"App_Occ2End",17,26,null,null,null,null,null,null,null,null,null,null,null,null,null,null,"LF4ftT8(32W)Std-Elect",31,59,90,118,null,177,null,236,null,null,130,{"$f":"IFERROR(INDEX(IDRefTable_Existing[Fixt ID],AD141),\"\")","v":""},null,null,null,null,null,null,null,null,null,null,{"$f":"IFERROR(INDEX(IDRefTable_Proposed[Fixt ID],AD141),\"\")","v":""}]
[null,"App_Occ3Start",17,36,null,null,null,null,null,null,null,null,null,null,null,null,null,null,"LF4ftT8(32W)LBF",25,48,72,95,null,144,null,192,null,null,{"$f":"AD141+1","v":131},{"$f":"IFERROR(INDEX(IDRefTable_Existing[Fixt ID],AD142),\"\")","v":""},null,null,null,null,null,null,null,null,null,null,{"$f":"IFERROR(INDEX(IDRefTable_Proposed[Fixt ID],AD142),\"\")","v":""}]
[null,"App_Occ3End",17,38,null,null,null,null,null,null,null,null,null,null,null,null,null,null,"LF4ftT8(32W)NBF",28,55,81,108,null,165,null,220,null,null,132,{"$f":"IFERROR(INDEX(IDRefTable_Existing[Fixt ID],AD143),\"\")","v":""},null,null,null,null,null,null,null,null,null,null,{"$f":"IFERROR(INDEX(IDRefTable_Proposed[Fixt ID],AD143),\"\")","v":""}]
[null,"App_Occ1StartHr",18,4,null,null,null,null,null,null,null,null,null,null,null,null,null,null,"LF4ftT8(32W)HBF",38,74,110,148,null,222,null,296,null,null,133,{"$f":"IFERROR(INDEX(IDRefTable_Existing[Fixt ID],AD144),\"\")","v":""},null,null,null,null,null,null,null,null,null,null,{"$f":"IFERROR(INDEX(IDRefTable_Proposed[Fixt ID],AD144),\"\")","v":""}]
[null,"App_Occ1StartMin",18,6,null,null,null,null,null,null,null,null,null,null,null,null,null,null,"LF2ftT5(14W)Std-Elect",17,33,50,66,null,99,null,null,null,null,134,{"$f":"IFERROR(INDEX(IDRefTable_Existing[Fixt ID],AD145),\"\")","v":""},null,null,null,null,null,null,null,null,null,null,{"$f":"IFERROR(INDEX(IDRefTable_Proposed[Fixt ID],AD145),\"\")","v":""}]
[null,"App_Occ1StartAMPM",18,7,null,null,null,null,null,null,null,null,null,null,null,null,null,null,"LF2ftT5(24W (HO))Std-Elect",27,52,79,104,null,156,null,null,null,null,135,{"$f":"IFERROR(INDEX(IDRefTable_Existing[Fixt ID],AD146),\"\")","v":""},null,null,null,null,null,null,null,null,null,null,{"$f":"IFERROR(INDEX(IDRefTable_Proposed[Fixt ID],AD146),\"\")","v":""}]
[null,"App_Occ1EndHr",18,9,null,null,null,null,null,null,null,null,null,null,null,null,null,null,"LF4ftT5(25-26W)Std-Elect",30,58,88,116,null,174,null,232,null,null,136,{"$f":"IFERROR(INDEX(IDRefTable_Existing[Fixt ID],AD147),\"\")","v":""},null,null,null,null,null,null,null,null,null,null,{"$f":"IFERROR(INDEX(IDRefTable_Proposed[Fixt ID],AD147),\"\")","v":""}]
[null,"App_Occ1EndMin",18,11,null,null,null,null,null,null,null,null,null,null,null,null,null,null,"LF4ftT5(28W)Std-Elect",33,63,96,126,null,189,null,252,null,null,137,{"$f":"IFERROR(INDEX(IDRefTable_Existing[Fixt ID],AD148),\"\")","v":""},null,null,null,null,null,null,null,null,null,null,{"$f":"IFERROR(INDEX(IDRefTable_Proposed[Fixt ID],AD148),\"\")","v":""}]
[null,"App_Occ1EndAMPM",18,13,null,null,null,null,null,null,null,null,null,null,null,null,null,null,"LF4ftT5(44-47W (HO))Std-Elect",53,105,158,210,null,315,null,420,null,null,138,{"$f":"IFERROR(INDEX(IDRefTable_Existing[Fixt ID],AD149),\"\")","v":""},null,null,null,null,null,null,null,null,null,null,{"$f":"IFERROR(INDEX(IDRefTable_Proposed[Fixt ID],AD149),\"\")","v":""}]
[null,"App_Occ2StartHr",18,16,null,null,null,null,null,null,null,null,null,null,null,null,null,null,"LF4ftT5(49-51W (HO))Std-Elect",58,112,170,224,null,336,null,448,null,null,139,{"$f":"IFERROR(INDEX(IDRefTable_Existing[Fixt ID],AD150),\"\")","v":""},null,null,null,null,null,null,null,null,null,null,{"$f":"IFERROR(INDEX(IDRefTable_Proposed[Fixt ID],AD150),\"\")","v":""}]
[null,"App_Occ2StartMin",18,18,null,null,null,null,null,null,null,null,null,null,null,null,null,null,"LF4ftT5(54W (HO))Std-Elect",62,118,179,234,null,352,null,472,null,null,140,{"$f":"IFERROR(INDEX(IDRefTable_Existing[Fixt ID],AD151),\"\")","v":""},null,null,null,null,null,null,null,null,null,null,{"$f":"IFERROR(INDEX(IDRefTable_Proposed[Fixt ID],AD151),\"\")","v":""}]
[null,"App_Occ2StartAMPM",18,19,null,null,null,null,null,null,null,null,null,null,null,null,null,null,"MH(35W)Mag",55,null,null,null,null,null,null,null,null,null,141,{"$f":"IFERROR(INDEX(IDRefTable_Existing[Fixt ID],AD152),\"\")","v":""},null,null,null,null,null,null,null,null,null,null,{"$f":"IFERROR(INDEX(IDRefTable_Proposed[Fixt ID],AD152),\"\")","v":""}]
[null,"App_Occ2EndHr",18,21,null,null,null,null,null,null,null,null,null,null,null,null,null,null,"MH(50W)Mag",62,null,null,null,null,null,null,null,null,null,142,{"$f":"IFERROR(INDEX(IDRefTable_Existing[Fixt ID],AD153),\"\")","v":""},null,null,null,null,null,null,null,null,null,null,{"$f":"IFERROR(INDEX(IDRefTable_Proposed[Fixt ID],AD153),\"\")","v":""}]
[null,"App_Occ2EndMin",18,23,null,null,null,null,null,null,null,null,null,null,null,null,null,null,"MH(70W)Mag",90,null,null,null,null,null,null,null,null,null,143,{"$f":"IFERROR(INDEX(IDRefTable_Existing[Fixt ID],AD154),\"\")","v":""},null,null,null,null,null,null,null,null,null,null,{"$f":"IFERROR(INDEX(IDRefTable_Proposed[Fixt ID],AD154),\"\")","v":""}]
[null,"App_Occ2EndAMPM",18,25,null,null,null,null,null,null,null,null,null,null,null,null,null,null,"MH(100W)Mag",129,null,null,null,null,null,null,null,null,null,144,{"$f":"IFERROR(INDEX(IDRefTable_Existing[Fixt ID],AD155),\"\")","v":""},null,null,null,null,null,null,null,null,null,null,{"$f":"IFERROR(INDEX(IDRefTable_Proposed[Fixt ID],AD155),\"\")","v":""}]
[null,"App_Occ3StartHr",18,28,null,null,null,null,null,null,null,null,null,null,null,null,null,null,"MH(150W)Mag",185,null,null,null,null,null,null,null,null,null,145,{"$f":"IFERROR(INDEX(IDRefTable_Existing[Fixt ID],AD156),\"\")","v":""},null,null,null,null,null,null,null,null,null,null,{"$f":"IFERROR(INDEX(IDRefTable_Proposed[Fixt ID],AD156),\"\")","v":""}]
[null,"App_Occ3StartMin",18,30,null,null,null,null,null,null,null,null,null,null,null,null,null,null,"MH(175W)Mag",210,null,null,null,null,null,null,null,null,null,146,{"$f":"IFERROR(INDEX(IDRefTable_Existing[Fixt ID],AD157),\"\")","v":""},null,null,null,null,null,null,null,null,null,null,{"$f":"IFERROR(INDEX(IDRefTable_Proposed[Fixt ID],AD157),\"\")","v":""}]
[null,"App_Occ3StartAMPM",18,31,null,null,null,null,null,null,null,null,null,null,null,null,null,null,"MH(200W)Mag",232,null,null,null,null,null,null,null,null,null,147,{"$f":"IFERROR(INDEX(IDRefTable_Existing[Fixt ID],AD158),\"\")","v":""},null,null,null,null,null,null,null,null,null,null,{"$f":"IFERROR(INDEX(IDRefTable_Proposed[Fixt ID],AD158),\"\")","v":""}]
[null,"App_Occ3EndHr",18,33,null,null,null,null,null,null,null,null,null,null,null,null,null,null,"MH(250W)Mag",295,null,null,null,null,null,null,null,null,null,148,{"$f":"IFERROR(INDEX(IDRefTable_Existing[Fixt ID],AD159),\"\")","v":""},null,null,null,null,null,null,null,null,null,null,{"$f":"IFERROR(INDEX(IDRefTable_Proposed[Fixt ID],AD159),\"\")","v":""}]
[null,"App_Occ3EndMin",18,35,null,null,null,null,null,null,null,null,null,null,null,null,null,null,"MH(320W)Mag",378,null,null,null,null,null,null,null,null,null,149,{"$f":"IFERROR(INDEX(IDRefTable_Existing[Fixt ID],AD160),\"\")","v":""},null,null,null,null,null,null,null,null,null,null,{"$f":"IFERROR(INDEX(IDRefTable_Proposed[Fixt ID],AD160),\"\")","v":""}]
[null,"App_Occ3EndAMPM",18,37,null,null,null,null,null,null,null,null,null,null,null,null,null,null,"MH(400W)Mag",458,null,null,null,null,null,null,null,null,null,150,{"$f":"IFERROR(INDEX(IDRefTable_Existing[Fixt ID],AD161),\"\")","v":""},null,null,null,null,null,null,null,null,null,null,{"$f":"IFERROR(INDEX(IDRefTable_Proposed[Fixt ID],AD161),\"\")","v":""}]
[null,"App_DaysClosed",18,39,null,null,null,null,null,null,null,null,null,null,null,null,null,null,"MH(750W)Mag",818,null,null,null,null,null,null,null,null,null,151,{"$f":"IFERROR(INDEX(IDRefTable_Existing[Fixt ID],AD162),\"\")","v":""},null,null,null,null,null,null,null,null,null,null,{"$f":"IFERROR(INDEX(IDRefTable_Proposed[Fixt ID],AD162),\"\")","v":""}]
[null,"App_247Flag",18,49,null,null,null,null,null,null,null,null,null,null,null,null,null,null,"MH(1000W)Mag",1080,null,null,null,null,null,null,null,null,null,152,{"$f":"IFERROR(INDEX(IDRefTable_Existing[Fixt ID],AD163),\"\")","v":""},null,null,null,null,null,null,null,null,null,null,{"$f":"IFERROR(INDEX(IDRefTable_Proposed[Fixt ID],AD163),\"\")","v":""}]
[null,"App_CustName",24,4,null,null,null,null,null,null,null,null,null,null,null,null,null,null,"MH(1500W)Mag",1605,null,null,null,null,null,null,null,null,null,153,{"$f":"IFERROR(INDEX(IDRefTable_Existing[Fixt ID],AD164),\"\")","v":""},null,null,null,null,null,null,null,null,null,null,{"$f":"IFERROR(INDEX(IDRefTable_Proposed[Fixt ID],AD164),\"\")","v":""}]
[null,"App_CustAdd",24,21,null,null,null,null,null,null,null,null,null,null,null,null,null,null,"MH(35W)Pulse-Start",55,null,null,null,null,null,null,null,null,null,154,{"$f":"IFERROR(INDEX(IDRefTable_Existing[Fixt ID],AD165),\"\")","v":""},null,null,null,null,null,null,null,null,null,null,{"$f":"IFERROR(INDEX(IDRefTable_Proposed[Fixt ID],AD165),\"\")","v":""}]
[null,"App_CustCity",24,37,null,null,null,null,null,null,null,null,null,null,null,null,null,null,"MH(50W)Pulse-Start",62,null,null,null,null,null,null,null,null,null,155,{"$f":"IFERROR(INDEX(IDRefTable_Existing[Fixt ID],AD166),\"\")","v":""},null,null,null,null,null,null,null,null,null,null,{"$f":"IFERROR(INDEX(IDRefTable_Proposed[Fixt ID],AD166),\"\")","v":""}]
[null,"App_CustState",24,42,null,null,null,null,null,null,null,null,null,null,null,null,null,null,"MH(70W)Pulse-Start",90,null,null,null,null,null,null,null,null,null,156,{"$f":"IFERROR(INDEX(IDRefTable_Existing[Fixt ID],AD167),\"\")","v":""},null,null,null,null,null,null,null,null,null,null,{"$f":"IFERROR(INDEX(IDRefTable_Proposed[Fixt ID],AD167),\"\")","v":""}]
[null,"App_CustZip",24,44,null,null,null,null,null,null,null,null,null,null,null,null,null,null,"MH(100W)Pulse-Start",129,null,null,null,null,null,null,null,null,null,157,{"$f":"IFERROR(INDEX(IDRefTable_Existing[Fixt ID],AD168),\"\")","v":""},null,null,null,null,null,null,null,null,null,null,{"$f":"IFERROR(INDEX(IDRefTable_Proposed[Fixt ID],AD168),\"\")","v":""}]
[null,"App_SameAddressFlag",24,49,null,null,null,null,null,null,null,null,null,null,null,null,null,null,"MH(150W)Pulse-Start",185,null,null,null,null,null,null,null,null,null,158,{"$f":"IFERROR(INDEX(IDRefTable_Existing[Fixt ID],AD169),\"\")","v":""},null,null,null,null,null,null,null,null,null,null,{"$f":"IFERROR(INDEX(IDRefTable_Proposed[Fixt ID],AD169),\"\")","v":""}]
[null,"App_CustPriName",26,4,null,null,null,null,null,null,null,null,null,null,null,null,null,null,"MH(175W)Pulse-Start",198,null,null,null,null,null,null,null,null,null,159,{"$f":"IFERROR(INDEX(IDRefTable_Existing[Fixt ID],AD170),\"\")","v":""},null,null,null,null,null,null,null,null,null,null,{"$f":"IFERROR(INDEX(IDRefTable_Proposed[Fixt ID],AD170),\"\")","v":""}]
[null,"App_CustPriTitle",26,15,null,null,null,null,null,null,null,null,null,null,null,null,null,null,"MH(200W)Pulse-Start",232,null,null,null,null,null,null,null,null,null,160,{"$f":"IFERROR(INDEX(IDRefTable_Existing[Fixt ID],AD171),\"\")","v":""},null,null,null,null,null,null,null,null,null,null,{"$f":"IFERROR(INDEX(IDRefTable_Proposed[Fixt ID],AD171),\"\")","v":""}]
[null,"App_CustPriPhone",26,26,null,null,null,null,null,null,null,null,null,null,null,null,null,null,"MH(250W)Pulse-Start",288,null,null,null,null,null,null,null,null,null,161,{"$f":"IFERROR(INDEX(IDRefTable_Existing[Fixt ID],AD172),\"\")","v":""},null,null,null,null,null,null,null,null,null,null,{"$f":"IFERROR(INDEX(IDRefTable_Proposed[Fixt ID],AD172),\"\")","v":""}]
[null,"App_CustPriFax",26,32,null,null,null,null,null,null,null,null,null,null,null,null,null,null,"MH(320W)Pulse-Start",363,null,null,null,null,null,null,null,null,null,162,{"$f":"IFERROR(INDEX(IDRefTable_Existing[Fixt ID],AD173),\"\")","v":""},null,null,null,null,null,null,null,null,null,null,{"$f":"IFERROR(INDEX(IDRefTable_Proposed[Fixt ID],AD173),\"\")","v":""}]
[null,"App_CustPriEmail",26,40,null,null,null,null,null,null,null,null,null,null,null,null,null,null,"MH(400W)Pulse-Start",452,null,null,null,null,null,null,null,null,null,163,{"$f":"IFERROR(INDEX(IDRefTable_Existing[Fixt ID],AD174),\"\")","v":""},null,null,null,null,null,null,null,null,null,null,{"$f":"IFERROR(INDEX(IDRefTable_Proposed[Fixt ID],AD174),\"\")","v":""}]
[null,"App_CustSecName",28,4,null,null,null,null,null,null,null,null,null,null,null,null,null,null,"MH(750W)Pulse-Start",818,null,null,null,null,null,null,null,null,null,164,{"$f":"IFERROR(INDEX(IDRefTable_Existing[Fixt ID],AD175),\"\")","v":""},null,null,null,null,null,null,null,null,null,null,{"$f":"IFERROR(INDEX(IDRefTable_Proposed[Fixt ID],AD175),\"\")","v":""}]
[null,"App_CustSecTitle",28,15,null,null,null,null,null,null,null,null,null,null,null,null,null,null,"MH(1000W)Pulse-Start",1080,null,null,null,null,null,null,null,null,null,165,{"$f":"IFERROR(INDEX(IDRefTable_Existing[Fixt ID],AD176),\"\")","v":""},null,null,null,null,null,null,null,null,null,null,{"$f":"IFERROR(INDEX(IDRefTable_Proposed[Fixt ID],AD176),\"\")","v":""}]
[null,"App_CustSecPhone",28,26,null,null,null,null,null,null,null,null,null,null,null,null,null,null,"MH(1500W)Pulse-Start",1605,null,null,null,null,null,null,null,null,null,166,{"$f":"IFERROR(INDEX(IDRefTable_Existing[Fixt ID],AD177),\"\")","v":""},null,null,null,null,null,null,null,null,null,null,{"$f":"IFERROR(INDEX(IDRefTable_Proposed[Fixt ID],AD177),\"\")","v":""}]
[null,"App_CustSecFax",28,32,null,null,null,null,null,null,null,null,null,null,null,null,null,null,"CMH(20W)Elect",23,{"$f":"T178*2","v":46},null,null,null,null,null,null,null,null,167,{"$f":"IFERROR(INDEX(IDRefTable_Existing[Fixt ID],AD178),\"\")","v":""},null,null,null,null,null,null,null,null,null,null,{"$f":"IFERROR(INDEX(IDRefTable_Proposed[Fixt ID],AD178),\"\")","v":""}]
[null,"App_CustSecEmail",28,40,null,null,null,null,null,null,null,null,null,null,null,null,null,null,"CMH(39W)Elect",44,{"$f":"T179*2","v":88},null,null,null,null,null,null,null,null,168,{"$f":"IFERROR(INDEX(IDRefTable_Existing[Fixt ID],AD179),\"\")","v":""},null,null,null,null,null,null,null,null,null,null,{"$f":"IFERROR(INDEX(IDRefTable_Proposed[Fixt ID],AD179),\"\")","v":""}]
[null,"App_EstStart",33,13,null,null,null,null,null,null,null,null,null,null,null,null,null,null,"CMH(50W)Elect",57,114,null,null,null,null,null,null,null,null,169,{"$f":"IFERROR(INDEX(IDRefTable_Existing[Fixt ID],AD180),\"\")","v":""},null,null,null,null,null,null,null,null,null,null,{"$f":"IFERROR(INDEX(IDRefTable_Proposed[Fixt ID],AD180),\"\")","v":""}]
[null,"App_EstEnd",34,13,null,null,null,null,null,null,null,null,null,null,null,null,null,null,"CMH(70W)Elect",79,158,null,null,null,null,null,null,null,null,170,{"$f":"IFERROR(INDEX(IDRefTable_Existing[Fixt ID],AD181),\"\")","v":""},null,null,null,null,null,null,null,null,null,null,{"$f":"IFERROR(INDEX(IDRefTable_Proposed[Fixt ID],AD181),\"\")","v":""}]
[null,"App_Installer",null,null,null,null,null,null,null,null,null,null,null,null,null,null,null,null,"CMH(100W)Elect",109,218,null,null,null,null,null,null,null,null,171,{"$f":"IFERROR(INDEX(IDRefTable_Existing[Fixt ID],AD182),\"\")","v":""},null,null,null,null,null,null,null,null,null,null,{"$f":"IFERROR(INDEX(IDRefTable_Proposed[Fixt ID],AD182),\"\")","v":""}]
[null,"TAcompany",49,6,null,null,null,null,null,null,null,null,null,null,null,null,null,null,"CMH(150W)Elect",165,330,null,null,null,null,null,null,null,null,172,{"$f":"IFERROR(INDEX(IDRefTable_Existing[Fixt ID],AD183),\"\")","v":""},null,null,null,null,null,null,null,null,null,null,{"$f":"IFERROR(INDEX(IDRefTable_Proposed[Fixt ID],AD183),\"\")","v":""}]
[null,"TAaddress",51,6,null,null,null,null,null,null,null,null,null,null,null,null,null,null,"CMHL(20W)Elect",23,{"$f":"T184*2","v":46},null,null,null,null,null,null,null,null,173,{"$f":"IFERROR(INDEX(IDRefTable_Existing[Fixt ID],AD184),\"\")","v":""},null,null,null,null,null,null,null,null,null,null,{"$f":"IFERROR(INDEX(IDRefTable_Proposed[Fixt ID],AD184),\"\")","v":""}]
[null,"TAcity",51,30,null,null,null,null,null,null,null,null,null,null,null,null,null,null,"CMHL(25W)Elect",23,{"$f":"T185*2","v":46},null,null,null,null,null,null,null,null,174,{"$f":"IFERROR(INDEX(IDRefTable_Existing[Fixt ID],AD185),\"\")","v":""},null,null,null,null,null,null,null,null,null,null,{"$f":"IFERROR(INDEX(IDRefTable_Proposed[Fixt ID],AD185),\"\")","v":""}]
[null,"TAstate",51,38,null,null,null,null,null,null,null,null,null,null,null,null,null,null,"CMHL(39W)Elect",44,88,null,null,null,null,null,null,null,null,175,{"$f":"IFERROR(INDEX(IDRefTable_Existing[Fixt ID],AD186),\"\")","v":""},null,null,null,null,null,null,null,null,null,null,{"$f":"IFERROR(INDEX(IDRefTable_Proposed[Fixt ID],AD186),\"\")","v":""}]
[null,"TAzip",51,41,null,null,null,null,null,null,null,null,null,null,null,null,null,null,"CMHL(50W)Elect",57,114,null,null,null,null,null,null,null,null,176,{"$f":"IFERROR(INDEX(IDRefTable_Existing[Fixt ID],AD187),\"\")","v":""},null,null,null,null,null,null,null,null,null,null,{"$f":"IFERROR(INDEX(IDRefTable_Proposed[Fixt ID],AD187),\"\")","v":""}]
[null,"TAcontact",49,20,null,null,null,null,null,null,null,null,null,null,null,null,null,null,"CMHL(70W)Elect",79,158,null,null,null,null,null,null,null,null,177,{"$f":"IFERROR(INDEX(IDRefTable_Existing[Fixt ID],AD188),\"\")","v":""},null,null,null,null,null,null,null,null,null,null,{"$f":"IFERROR(INDEX(IDRefTable_Proposed[Fixt ID],AD188),\"\")","v":""}]
[null,"TAtitle",null,null,null,null,null,null,null,null,null,null,null,null,null,null,null,null,"CMHL(100W)Elect",109,218,null,null,null,null,null,null,null,null,178,{"$f":"IFERROR(INDEX(IDRefTable_Existing[Fixt ID],AD189),\"\")","v":""},null,null,null,null,null,null,null,null,null,null,{"$f":"IFERROR(INDEX(IDRefTable_Proposed[Fixt ID],AD189),\"\")","v":""}]
[null,"TAphone",49,30,null,null,null,null,null,null,null,null,null,null,null,null,null,null,"HPS(35W)Mag",45,null,null,null,null,null,null,null,null,null,179,{"$f":"IFERROR(INDEX(IDRefTable_Existing[Fixt ID],AD190),\"\")","v":""},null,null,null,null,null,null,null,null,null,null,{"$f":"IFERROR(INDEX(IDRefTable_Proposed[Fixt ID],AD190),\"\")","v":""}]
[null,"TAmobile",null,null,null,null,null,null,null,null,null,null,null,null,null,null,null,null,"HPS(50W)Mag",68,null,null,null,null,null,null,null,null,null,180,{"$f":"IFERROR(INDEX(IDRefTable_Existing[Fixt ID],AD191),\"\")","v":""},null,null,null,null,null,null,null,null,null,null,{"$f":"IFERROR(INDEX(IDRefTable_Proposed[Fixt ID],AD191),\"\")","v":""}]
[null,"TAemail",49,38,null,null,null,null,null,null,null,null,null,null,null,null,null,null,"HPS(70W)Mag",86,null,null,null,null,null,null,null,null,null,181,{"$f":"IFERROR(INDEX(IDRefTable_Existing[Fixt ID],AD192),\"\")","v":""},null,null,null,null,null,null,null,null,null,null,{"$f":"IFERROR(INDEX(IDRefTable_Proposed[Fixt ID],AD192),\"\")","v":""}]
[null,"App_PDIRecipient",null,null,null,null,null,null,null,null,null,null,null,null,null,null,null,null,"HPS(100W)Mag",120,null,null,null,null,null,null,null,null,null,182,{"$f":"IFERROR(INDEX(IDRefTable_Existing[Fixt ID],AD193),\"\")","v":""},null,null,null,null,null,null,null,null,null,null,{"$f":"IFERROR(INDEX(IDRefTable_Proposed[Fixt ID],AD193),\"\")","v":""}]
[null,"App_AppName",56,4,null,null,null,null,null,null,null,null,null,null,null,null,null,null,"HPS(150W)Mag",170,null,null,null,null,null,null,null,null,null,183,{"$f":"IFERROR(INDEX(IDRefTable_Existing[Fixt ID],AD194),\"\")","v":""},null,null,null,null,null,null,null,null,null,null,{"$f":"IFERROR(INDEX(IDRefTable_Proposed[Fixt ID],AD194),\"\")","v":""}]
[null,"App_AppTitle",56,18,null,null,null,null,null,null,null,null,null,null,null,null,null,null,"HPS(200W)Mag",245,null,null,null,null,null,null,null,null,null,184,{"$f":"IFERROR(INDEX(IDRefTable_Existing[Fixt ID],AD195),\"\")","v":""},null,null,null,null,null,null,null,null,null,null,{"$f":"IFERROR(INDEX(IDRefTable_Proposed[Fixt ID],AD195),\"\")","v":""}]
[null,"App_AppSig",56,31,null,null,null,null,null,null,null,null,null,null,null,null,null,null,"HPS(250W)Mag",295,null,null,null,null,null,null,null,null,null,185,{"$f":"IFERROR(INDEX(IDRefTable_Existing[Fixt ID],AD196),\"\")","v":""},null,null,null,null,null,null,null,null,null,null,{"$f":"IFERROR(INDEX(IDRefTable_Proposed[Fixt ID],AD196),\"\")","v":""}]
[null,"App_AppDate",56,44,null,null,null,null,null,null,null,null,null,null,null,null,null,null,"HPS(310W)Mag",365,null,null,null,null,null,null,null,null,null,186,{"$f":"IFERROR(INDEX(IDRefTable_Existing[Fixt ID],AD197),\"\")","v":""},null,null,null,null,null,null,null,null,null,null,{"$f":"IFERROR(INDEX(IDRefTable_Proposed[Fixt ID],AD197),\"\")","v":""}]
[null,null,null,null,null,null,null,null,null,null,null,null,null,null,null,null,null,null,"HPS(400W)Mag",457,null,null,null,null,null,null,null,null,null,187,{"$f":"IFERROR(INDEX(IDRefTable_Existing[Fixt ID],AD198),\"\")","v":""},null,null,null,null,null,null,null,null,null,null,{"$f":"IFERROR(INDEX(IDRefTable_Proposed[Fixt ID],AD198),\"\")","v":""}]
[null,"Participation Agreement Import Ranges",null,null,null,null,null,null,null,null,null,null,null,null,null,null,null,null,"HPS(600W)Mag",670,null,null,null,null,null,null,null,null,null,188,{"$f":"IFERROR(INDEX(IDRefTable_Existing[Fixt ID],AD199),\"\")","v":""},null,null,null,null,null,null,null,null,null,null,{"$f":"IFERROR(INDEX(IDRefTable_Proposed[Fixt ID],AD199),\"\")","v":""}]
[null,"Range Name","Old Wkbk Row Ref","Old Wkbk Col Ref",null,null,null,null,null,null,null,null,null,null,null,null,null,null,"HPS(750W)Mag",840,null,null,null,null,null,null,null,null,null,189,{"$f":"IFERROR(INDEX(IDRefTable_Existing[Fixt ID],AD200),\"\")","v":""},null,null,null,null,null,null,null,null,null,null,{"$f":"IFERROR(INDEX(IDRefTable_Proposed[Fixt ID],AD200),\"\")","v":""}]
[null,"ProjectVerification",21,3,null,null,null,null,null,null,null,null,null,null,null,null,null,null,"HPS(1000W)Mag",1100,null,null,null,null,null,null,null,null,null,190,{"$f":"IFERROR(INDEX(IDRefTable_Existing[Fixt ID],AD201),\"\")","v":""},null,null,null,null,null,null,null,null,null,null,{"$f":"IFERROR(INDEX(IDRefTable_Proposed[Fixt ID],AD201),\"\")","v":""}]
[null,"PACustChoice",35,30,null,null,null,null,null,null,null,null,null,null,null,null,null,null,"LPS(18W)Mag",30,null,null,null,null,null,null,null,null,null,191,{"$f":"IFERROR(INDEX(IDRefTable_Existing[Fixt ID],AD202),\"\")","v":""},null,null,null,null,null,null,null,null,null,null,{"$f":"IFERROR(INDEX(IDRefTable_Proposed[Fixt ID],AD202),\"\")","v":""}]
[null,null,null,null,null,null,null,null,null,null,null,null,null,null,null,null,null,null,"LPS(35W)Mag",50,null,null,null,null,null,null,null,null,null,192,{"$f":"IFERROR(INDEX(IDRefTable_Existing[Fixt ID],AD203),\"\")","v":""},null,null,null,null,null,null,null,null,null,null,{"$f":"IFERROR(INDEX(IDRefTable_Proposed[Fixt ID],AD203),\"\")","v":""}]
[null,"Lighting Input Form Import Ranges",null,null,null,null,null,null,null,null,null,null,null,null,null,null,null,null,"LPS(55W)Mag",80,null,null,null,null,null,null,null,null,null,193,{"$f":"IFERROR(INDEX(IDRefTable_Existing[Fixt ID],AD204),\"\")","v":""},null,null,null,null,null,null,null,null,null,null,{"$f":"IFERROR(INDEX(IDRefTable_Proposed[Fixt ID],AD204),\"\")","v":""}]
[null,"Range Name","Old Wkbk Row Ref","Old Wkbk Col Ref",null,null,null,null,null,null,null,null,null,null,null,null,null,null,"LPS(90W)Mag",125,null,null,null,null,null,null,null,null,null,194,{"$f":"IFERROR(INDEX(IDRefTable_Existing[Fixt ID],AD205),\"\")","v":""},null,null,null,null,null,null,null,null,null,null,{"$f":"IFERROR(INDEX(IDRefTable_Proposed[Fixt ID],AD205),\"\")","v":""}]
[null,"LIF_CompletedBy",8,25,null,null,null,null,null,null,null,null,null,null,null,null,null,null,"LPS(135W)Mag",156,null,null,null,null,null,null,null,null,null,195,{"$f":"IFERROR(INDEX(IDRefTable_Existing[Fixt ID],AD206),\"\")","v":""},null,null,null,null,null,null,null,null,null,null,{"$f":"IFERROR(INDEX(IDRefTable_Proposed[Fixt ID],AD206),\"\")","v":""}]
[null,"LIF_Date",9,25,null,null,null,null,null,null,null,null,null,null,null,null,null,null,"LPS(180W)Mag",208,null,null,null,null,null,null,null,null,null,196,{"$f":"IFERROR(INDEX(IDRefTable_Existing[Fixt ID],AD207),\"\")","v":""},null,null,null,null,null,null,null,null,null,null,{"$f":"IFERROR(INDEX(IDRefTable_Proposed[Fixt ID],AD207),\"\")","v":""}]
[null,"LIF_MatCost",null,null,null,null,null,null,null,null,null,null,null,null,null,null,null,null,"MV(100W)Mag",125,null,null,null,null,null,null,null,null,null,197,{"$f":"IFERROR(INDEX(IDRefTable_Existing[Fixt ID],AD208),\"\")","v":""},null,null,null,null,null,null,null,null,null,null,{"$f":"IFERROR(INDEX(IDRefTable_Proposed[Fixt ID],AD208),\"\")","v":""}]
[null,"LIF_LabCost",null,null,null,null,null,null,null,null,null,null,null,null,null,null,null,null,"MV(175W)Mag",205,null,null,null,null,null,null,null,null,null,198,{"$f":"IFERROR(INDEX(IDRefTable_Existing[Fixt ID],AD209),\"\")","v":""},null,null,null,null,null,null,null,null,null,null,{"$f":"IFERROR(INDEX(IDRefTable_Proposed[Fixt ID],AD209),\"\")","v":""}]
[null,"LIF_MisCost",null,null,null,null,null,null,null,null,null,null,null,null,null,null,null,null,"MV(250W)Mag",285,null,null,null,null,null,null,null,null,null,199,{"$f":"IFERROR(INDEX(IDRefTable_Existing[Fixt ID],AD210),\"\")","v":""},null,null,null,null,null,null,null,null,null,null,{"$f":"IFERROR(INDEX(IDRefTable_Proposed[Fixt ID],AD210),\"\")","v":""}]
[null,"LIF_TaxRate",null,null,null,null,null,null,null,null,null,null,null,null,null,null,null,null,"MV(400W)Mag",454,null,null,null,null,null,null,null,null,null,200,{"$f":"IFERROR(INDEX(IDRefTable_Existing[Fixt ID],AD211),\"\")","v":""},null,null,null,null,null,null,null,null,null,null,{"$f":"IFERROR(INDEX(IDRefTable_Proposed[Fixt ID],AD211),\"\")","v":""}]
[null,"LIF_TotCost",null,null,null,null,null,null,null,null,null,null,null,null,null,null,null,null,"MV(1000W)Mag",1080,null,null,null,null,null,null,null,null,null,201,{"$f":"IFERROR(INDEX(IDRefTable_Existing[Fixt ID],AD212),\"\")","v":""},null,null,null,null,null,null,null,null,null,null,{"$f":"IFERROR(INDEX(IDRefTable_Proposed[Fixt ID],AD212),\"\")","v":""}]
[null,"LIF_Notes",null,null,null,null,null,null,null,null,null,null,null,null,null,null,null,null,"Exit(INC)",30,null,null,null,null,null,null,null,null,null,202,{"$f":"IFERROR(INDEX(IDRefTable_Existing[Fixt ID],AD213),\"\")","v":""},null,null,null,null,null,null,null,null,null,null,{"$f":"IFERROR(INDEX(IDRefTable_Proposed[Fixt ID],AD213),\"\")","v":""}]
[null,null,null,null,null,null,null,null,null,null,null,null,null,null,null,null,null,null,"Exit(CFL)",15,null,null,null,null,null,null,null,null,null,203,{"$f":"IFERROR(INDEX(IDRefTable_Existing[Fixt ID],AD214),\"\")","v":""},null,null,null,null,null,null,null,null,null,null,{"$f":"IFERROR(INDEX(IDRefTable_Proposed[Fixt ID],AD214),\"\")","v":""}]
[null,"Tracking Sheet Import Ranges",null,null,null,null,null,null,null,null,null,null,null,null,null,null,null,null,"ExitLED(LED)",3,null,null,null,null,null,null,null,null,null,204,{"$f":"IFERROR(INDEX(IDRefTable_Existing[Fixt ID],AD215),\"\")","v":""},null,null,null,null,null,null,null,null,null,null,{"$f":"IFERROR(INDEX(IDRefTable_Proposed[Fixt ID],AD215),\"\")","v":""}]
[null,"Range Name","Old Wkbk Row Ref","Old Wkbk Col Ref",null,null,null,null,null,null,null,null,null,null,null,null,null,null,null,null,null,null,null,null,null,null,null,null,null,205,{"$f":"IFERROR(INDEX(IDRefTable_Existing[Fixt ID],AD216),\"\")","v":""},null,null,null,null,null,null,null,null,null,null,{"$f":"IFERROR(INDEX(IDRefTable_Proposed[Fixt ID],AD216),\"\")","v":""}]
[null,"ManagedAcct",29,19,null,null,null,null,null,null,null,null,null,null,null,null,null,null,null,null,null,null,null,null,null,null,null,null,null,206,{"$f":"IFERROR(INDEX(IDRefTable_Existing[Fixt ID],AD217),\"\")","v":""},null,null,null,null,null,null,null,null,null,null,{"$f":"IFERROR(INDEX(IDRefTable_Proposed[Fixt ID],AD217),\"\")","v":""}]
[null,"CustVendor",null,null,null,null,null,null,null,null,null,null,null,null,null,null,null,null,null,null,null,null,null,null,null,null,null,null,null,207,{"$f":"IFERROR(INDEX(IDRefTable_Existing[Fixt ID],AD218),\"\")","v":""},null,null,null,null,null,null,null,null,null,null,{"$f":"IFERROR(INDEX(IDRefTable_Proposed[Fixt ID],AD218),\"\")","v":""}]
[null,"ContVendor",null,null,null,null,null,null,null,null,null,null,null,null,null,null,null,null,null,null,null,null,null,null,null,null,null,null,null,208,{"$f":"IFERROR(INDEX(IDRefTable_Existing[Fixt ID],AD219),\"\")","v":""},null,null,null,null,null,null,null,null,null,null,{"$f":"IFERROR(INDEX(IDRefTable_Proposed[Fixt ID],AD219),\"\")","v":""}]
[null,"ProjectName",11,8,null,null,null,null,null,null,null,null,null,null,null,null,null,null,null,null,null,null,null,null,null,null,null,null,null,209,{"$f":"IFERROR(INDEX(IDRefTable_Existing[Fixt ID],AD220),\"\")","v":""},null,null,null,null,null,null,null,null,null,null,{"$f":"IFERROR(INDEX(IDRefTable_Proposed[Fixt ID],AD220),\"\")","v":""}]
[null,"AssignedStaff",11,12,null,null,null,null,null,null,null,null,null,null,null,null,null,null,null,null,null,null,null,null,null,null,null,null,null,210,{"$f":"IFERROR(INDEX(IDRefTable_Existing[Fixt ID],AD221),\"\")","v":""},null,null,null,null,null,null,null,null,null,null,{"$f":"IFERROR(INDEX(IDRefTable_Proposed[Fixt ID],AD221),\"\")","v":""}]
[null,"AssignedDate",41,4,null,null,null,null,null,null,null,null,null,null,null,null,null,null,null,null,null,null,null,null,null,null,null,null,null,211,{"$f":"IFERROR(INDEX(IDRefTable_Existing[Fixt ID],AD222),\"\")","v":""},null,null,null,null,null,null,null,null,null,null,{"$f":"IFERROR(INDEX(IDRefTable_Proposed[Fixt ID],AD222),\"\")","v":""}]
[null,"CommitDate",41,3,null,null,null,null,null,null,null,null,null,null,null,null,null,null,null,null,null,null,null,null,null,null,null,null,null,212,{"$f":"IFERROR(INDEX(IDRefTable_Existing[Fixt ID],AD223),\"\")","v":""},null,null,null,null,null,null,null,null,null,null,{"$f":"IFERROR(INDEX(IDRefTable_Proposed[Fixt ID],AD223),\"\")","v":""}]
[null,"ExpPayDate",41,10,null,null,null,null,null,null,null,null,null,null,null,null,null,null,null,null,null,null,null,null,null,null,null,null,null,213,{"$f":"IFERROR(INDEX(IDRefTable_Existing[Fixt ID],AD224),\"\")","v":""},null,null,null,null,null,null,null,null,null,null,{"$f":"IFERROR(INDEX(IDRefTable_Proposed[Fixt ID],AD224),\"\")","v":""}]
[null,"SharePointID",null,null,null,null,null,null,null,null,null,null,null,null,null,null,null,null,null,null,null,null,null,null,null,null,null,null,null,214,{"$f":"IFERROR(INDEX(IDRefTable_Existing[Fixt ID],AD225),\"\")","v":""},null,null,null,null,null,null,null,null,null,null,{"$f":"IFERROR(INDEX(IDRefTable_Proposed[Fixt ID],AD225),\"\")","v":""}]
[null,"AuthBy",45,3,null,null,null,null,null,null,null,null,null,null,null,null,null,null,null,null,null,null,null,null,null,null,null,null,null,215,{"$f":"IFERROR(INDEX(IDRefTable_Existing[Fixt ID],AD226),\"\")","v":""},null,null,null,null,null,null,null,null,null,null,{"$f":"IFERROR(INDEX(IDRefTable_Proposed[Fixt ID],AD226),\"\")","v":""}]
[null,"AuthDate",45,4,null,null,null,null,null,null,null,null,null,null,null,null,null,null,null,null,null,null,null,null,null,null,null,null,null,216,{"$f":"IFERROR(INDEX(IDRefTable_Existing[Fixt ID],AD227),\"\")","v":""},null,null,null,null,null,null,null,null,null,null,{"$f":"IFERROR(INDEX(IDRefTable_Proposed[Fixt ID],AD227),\"\")","v":""}]
[null,"AuthExpDate",41,6,null,null,null,null,null,null,null,null,null,null,null,null,null,null,null,null,null,null,null,null,null,null,null,null,null,217,{"$f":"IFERROR(INDEX(IDRefTable_Existing[Fixt ID],AD228),\"\")","v":""},null,null,null,null,null,null,null,null,null,null,{"$f":"IFERROR(INDEX(IDRefTable_Proposed[Fixt ID],AD228),\"\")","v":""}]
[null,"ProjExpDate",41,8,null,null,null,null,null,null,null,null,null,null,null,null,null,null,null,null,null,null,null,null,null,null,null,null,null,218,{"$f":"IFERROR(INDEX(IDRefTable_Existing[Fixt ID],AD229),\"\")","v":""},null,null,null,null,null,null,null,null,null,null,{"$f":"IFERROR(INDEX(IDRefTable_Proposed[Fixt ID],AD229),\"\")","v":""}]
[null,"PayAuthBy",45,8,null,null,null,null,null,null,null,null,null,null,null,null,null,null,null,null,null,null,null,null,null,null,null,null,null,219,{"$f":"IFERROR(INDEX(IDRefTable_Existing[Fixt ID],AD230),\"\")","v":""},null,null,null,null,null,null,null,null,null,null,{"$f":"IFERROR(INDEX(IDRefTable_Proposed[Fixt ID],AD230),\"\")","v":""}]
[null,"PayAuthDate",45,9,null,null,null,null,null,null,null,null,null,null,null,null,null,null,null,null,null,null,null,null,null,null,null,null,null,220,{"$f":"IFERROR(INDEX(IDRefTable_Existing[Fixt ID],AD231),\"\")","v":""},null,null,null,null,null,null,null,null,null,null,{"$f":"IFERROR(INDEX(IDRefTable_Proposed[Fixt ID],AD231),\"\")","v":""}]
[null,null,null,null,null,null,null,null,null,null,null,null,null,null,null,null,null,null,null,null,null,null,null,null,null,null,null,null,null,221,{"$f":"IFERROR(INDEX(IDRefTable_Existing[Fixt ID],AD232),\"\")","v":""},null,null,null,null,null,null,null,null,null,null,{"$f":"IFERROR(INDEX(IDRefTable_Proposed[Fixt ID],AD232),\"\")","v":""}]
[null,"Tracking Sheet Auth Import Ranges",null,null,null,null,null,null,null,null,null,null,null,null,null,null,null,null,null,null,null,null,null,null,null,null,null,null,null,222,{"$f":"IFERROR(INDEX(IDRefTable_Existing[Fixt ID],AD233),\"\")","v":""},null,null,null,null,null,null,null,null,null,null,{"$f":"IFERROR(INDEX(IDRefTable_Proposed[Fixt ID],AD233),\"\")","v":""}]
[null,"Range Name","Old Wkbk Row Ref","Old Wkbk Col Ref",null,null,null,null,null,null,null,null,null,null,null,null,null,null,null,null,null,null,null,null,null,null,null,null,null,223,{"$f":"IFERROR(INDEX(IDRefTable_Existing[Fixt ID],AD234),\"\")","v":""},null,null,null,null,null,null,null,null,null,null,{"$f":"IFERROR(INDEX(IDRefTable_Proposed[Fixt ID],AD234),\"\")","v":""}]
[null,"AuthProjCost",47,3,null,null,null,null,null,null,null,null,null,null,null,null,null,null,null,null,null,null,null,null,null,null,null,null,null,224,{"$f":"IFERROR(INDEX(IDRefTable_Existing[Fixt ID],AD235),\"\")","v":""},null,null,null,null,null,null,null,null,null,null,{"$f":"IFERROR(INDEX(IDRefTable_Proposed[Fixt ID],AD235),\"\")","v":""}]
[null,"AuthBaseIncentive",49,3,null,null,null,null,null,null,null,null,null,null,null,null,null,null,null,null,null,null,null,null,null,null,null,null,null,225,{"$f":"IFERROR(INDEX(IDRefTable_Existing[Fixt ID],AD236),\"\")","v":""},null,null,null,null,null,null,null,null,null,null,{"$f":"IFERROR(INDEX(IDRefTable_Proposed[Fixt ID],AD236),\"\")","v":""}]
[null,"AuthBonusIncentive",null,null,null,null,null,null,null,null,null,null,null,null,null,null,null,null,null,null,null,null,null,null,null,null,null,null,null,226,{"$f":"IFERROR(INDEX(IDRefTable_Existing[Fixt ID],AD237),\"\")","v":""},null,null,null,null,null,null,null,null,null,null,{"$f":"IFERROR(INDEX(IDRefTable_Proposed[Fixt ID],AD237),\"\")","v":""}]
[null,"AuthAdminIncentive",null,null,null,null,null,null,null,null,null,null,null,null,null,null,null,null,null,null,null,null,null,null,null,null,null,null,null,227,{"$f":"IFERROR(INDEX(IDRefTable_Existing[Fixt ID],AD238),\"\")","v":""},null,null,null,null,null,null,null,null,null,null,{"$f":"IFERROR(INDEX(IDRefTable_Proposed[Fixt ID],AD238),\"\")","v":""}]
[null,"AuthCustSavings",51,3,null,null,null,null,null,null,null,null,null,null,null,null,null,null,null,null,null,null,null,null,null,null,null,null,null,228,{"$f":"IFERROR(INDEX(IDRefTable_Existing[Fixt ID],AD239),\"\")","v":""},null,null,null,null,null,null,null,null,null,null,{"$f":"IFERROR(INDEX(IDRefTable_Proposed[Fixt ID],AD239),\"\")","v":""}]
[null,"AuthIncentedSavings",53,3,null,null,null,null,null,null,null,null,null,null,null,null,null,null,null,null,null,null,null,null,null,null,null,null,null,229,{"$f":"IFERROR(INDEX(IDRefTable_Existing[Fixt ID],AD240),\"\")","v":""},null,null,null,null,null,null,null,null,null,null,{"$f":"IFERROR(INDEX(IDRefTable_Proposed[Fixt ID],AD240),\"\")","v":""}]
[null,"AuthNonIncented",55,3,null,null,null,null,null,null,null,null,null,null,null,null,null,null,null,null,null,null,null,null,null,null,null,null,null,230,{"$f":"IFERROR(INDEX(IDRefTable_Existing[Fixt ID],AD241),\"\")","v":""},null,null,null,null,null,null,null,null,null,null,{"$f":"IFERROR(INDEX(IDRefTable_Proposed[Fixt ID],AD241),\"\")","v":""}]
[null,"AuthkWRed",null,null,null,null,null,null,null,null,null,null,null,null,null,null,null,null,null,null,null,null,null,null,null,null,null,null,null,231,{"$f":"IFERROR(INDEX(IDRefTable_Existing[Fixt ID],AD242),\"\")","v":""},null,null,null,null,null,null,null,null,null,null,{"$f":"IFERROR(INDEX(IDRefTable_Proposed[Fixt ID],AD242),\"\")","v":""}]
[null,"AuthPeakkWRed",null,null,null,null,null,null,null,null,null,null,null,null,null,null,null,null,null,null,null,null,null,null,null,null,null,null,null,232,{"$f":"IFERROR(INDEX(IDRefTable_Existing[Fixt ID],AD243),\"\")","v":""},null,null,null,null,null,null,null,null,null,null,{"$f":"IFERROR(INDEX(IDRefTable_Proposed[Fixt ID],AD243),\"\")","v":""}]
[null,null,null,null,null,null,null,null,null,null,null,null,null,null,null,null,null,null,null,null,null,null,null,null,null,null,null,null,null,233,{"$f":"IFERROR(INDEX(IDRefTable_Existing[Fixt ID],AD244),\"\")","v":""},null,null,null,null,null,null,null,null,null,null,{"$f":"IFERROR(INDEX(IDRefTable_Proposed[Fixt ID],AD244),\"\")","v":""}]
[null,"Verification Report Import Ranges",null,null,null,null,null,null,null,null,null,null,null,null,null,null,null,null,null,null,null,null,null,null,null,null,null,null,null,234,{"$f":"IFERROR(INDEX(IDRefTable_Existing[Fixt ID],AD245),\"\")","v":""},null,null,null,null,null,null,null,null,null,null,{"$f":"IFERROR(INDEX(IDRefTable_Proposed[Fixt ID],AD245),\"\")","v":""}]
[null,"Range Name","Old Wkbk Row Ref","Old Wkbk Col Ref",null,null,null,null,null,null,null,null,null,null,null,null,null,null,null,null,null,null,null,null,null,null,null,null,null,235,{"$f":"IFERROR(INDEX(IDRefTable_Existing[Fixt ID],AD246),\"\")","v":""},null,null,null,null,null,null,null,null,null,null,{"$f":"IFERROR(INDEX(IDRefTable_Proposed[Fixt ID],AD246),\"\")","v":""}]
[null,"VerificationDate",10,18,null,null,null,null,null,null,null,null,null,null,null,null,null,null,null,null,null,null,null,null,null,null,null,null,null,236,{"$f":"IFERROR(INDEX(IDRefTable_Existing[Fixt ID],AD247),\"\")","v":""},null,null,null,null,null,null,null,null,null,null,{"$f":"IFERROR(INDEX(IDRefTable_Proposed[Fixt ID],AD247),\"\")","v":""}]
[null,"VR_Findings",28,3,null,null,null,null,null,null,null,null,null,null,null,null,null,null,null,null,null,null,null,null,null,null,null,null,null,237,{"$f":"IFERROR(INDEX(IDRefTable_Existing[Fixt ID],AD248),\"\")","v":""},null,null,null,null,null,null,null,null,null,null,{"$f":"IFERROR(INDEX(IDRefTable_Proposed[Fixt ID],AD248),\"\")","v":""}]
[null,"VR_Recommendations",51,3,null,null,null,null,null,null,null,null,null,null,null,null,null,null,null,null,null,null,null,null,null,null,null,null,null,238,{"$f":"IFERROR(INDEX(IDRefTable_Existing[Fixt ID],AD249),\"\")","v":""},null,null,null,null,null,null,null,null,null,null,{"$f":"IFERROR(INDEX(IDRefTable_Proposed[Fixt ID],AD249),\"\")","v":""}]
[null,"VerificationRepInitials",56,16,null,null,null,null,null,null,null,null,null,null,null,null,null,null,null,null,null,null,null,null,null,null,null,null,null,239,{"$f":"IFERROR(INDEX(IDRefTable_Existing[Fixt ID],AD250),\"\")","v":""},null,null,null,null,null,null,null,null,null,null,{"$f":"IFERROR(INDEX(IDRefTable_Proposed[Fixt ID],AD250),\"\")","v":""}]
[null,"VerificationRepDate",56,19,null,null,null,null,null,null,null,null,null,null,null,null,null,null,null,null,null,null,null,null,null,null,null,null,null,240,{"$f":"IFERROR(INDEX(IDRefTable_Existing[Fixt ID],AD251),\"\")","v":""},null,null,null,null,null,null,null,null,null,null,{"$f":"IFERROR(INDEX(IDRefTable_Proposed[Fixt ID],AD251),\"\")","v":""}]
[null,null,null,null,null,null,null,null,null,null,null,null,null,null,null,null,null,null,null,null,null,null,null,null,null,null,null,null,null,241,{"$f":"IFERROR(INDEX(IDRefTable_Existing[Fixt ID],AD252),\"\")","v":""},null,null,null,null,null,null,null,null,null,null,{"$f":"IFERROR(INDEX(IDRefTable_Proposed[Fixt ID],AD252),\"\")","v":""}]
[null,"Payment Request Import Ranges",null,null,null,null,null,null,null,null,null,null,null,null,null,null,null,null,null,null,null,null,null,null,null,null,null,null,null,242,{"$f":"IFERROR(INDEX(IDRefTable_Existing[Fixt ID],AD253),\"\")","v":""},null,null,null,null,null,null,null,null,null,null,{"$f":"IFERROR(INDEX(IDRefTable_Proposed[Fixt ID],AD253),\"\")","v":""}]
[null,"Range Name","Old Wkbk Row Ref","Old Wkbk Col Ref",null,null,null,null,null,null,null,null,null,null,null,null,null,null,null,null,null,null,null,null,null,null,null,null,null,243,{"$f":"IFERROR(INDEX(IDRefTable_Existing[Fixt ID],AD254),\"\")","v":""},null,null,null,null,null,null,null,null,null,null,{"$f":"IFERROR(INDEX(IDRefTable_Proposed[Fixt ID],AD254),\"\")","v":""}]
[null,"PayReqDate",15,3,null,null,null,null,null,null,null,null,null,null,null,null,null,null,null,null,null,null,null,null,null,null,null,null,null,244,{"$f":"IFERROR(INDEX(IDRefTable_Existing[Fixt ID],AD255),\"\")","v":""},null,null,null,null,null,null,null,null,null,null,{"$f":"IFERROR(INDEX(IDRefTable_Proposed[Fixt ID],AD255),\"\")","v":""}]
[null,"PayReqMailFlag",13,16,null,null,null,null,null,null,null,null,null,null,null,null,null,null,null,null,null,null,null,null,null,null,null,null,null,245,{"$f":"IFERROR(INDEX(IDRefTable_Existing[Fixt ID],AD256),\"\")","v":""},null,null,null,null,null,null,null,null,null,null,{"$f":"IFERROR(INDEX(IDRefTable_Proposed[Fixt ID],AD256),\"\")","v":""}]
[null,null,null,null,null,null,null,null,null,null,null,null,null,null,null,null,null,null,null,null,null,null,null,null,null,null,null,null,null,246,{"$f":"IFERROR(INDEX(IDRefTable_Existing[Fixt ID],AD257),\"\")","v":""},null,null,null,null,null,null,null,null,null,null,{"$f":"IFERROR(INDEX(IDRefTable_Proposed[Fixt ID],AD257),\"\")","v":""}]
[null,null,null,null,null,null,null,null,null,null,null,null,null,null,null,null,null,null,null,null,null,null,null,null,null,null,null,null,null,247,{"$f":"IFERROR(INDEX(IDRefTable_Existing[Fixt ID],AD258),\"\")","v":""},null,null,null,null,null,null,null,null,null,null,{"$f":"IFERROR(INDEX(IDRefTable_Proposed[Fixt ID],AD258),\"\")","v":""}]
[null,null,null,null,null,null,null,null,null,null,null,null,null,null,null,null,null,null,null,null,null,null,null,null,null,null,null,null,null,248,{"$f":"IFERROR(INDEX(IDRefTable_Existing[Fixt ID],AD259),\"\")","v":""},null,null,null,null,null,null,null,null,null,null,{"$f":"IFERROR(INDEX(IDRefTable_Proposed[Fixt ID],AD259),\"\")","v":""}]
[null,null,null,null,null,null,null,null,null,null,null,null,null,null,null,null,null,null,null,null,null,null,null,null,null,null,null,null,null,249,{"$f":"IFERROR(INDEX(IDRefTable_Existing[Fixt ID],AD260),\"\")","v":""},null,null,null,null,null,null,null,null,null,null,{"$f":"IFERROR(INDEX(IDRefTable_Proposed[Fixt ID],AD260),\"\")","v":""}]
[null,null,null,null,null,null,null,null,null,null,null,null,null,null,null,null,null,null,null,null,null,null,null,null,null,null,null,null,null,250,{"$f":"IFERROR(INDEX(IDRefTable_Existing[Fixt ID],AD261),\"\")","v":""},null,null,null,null,null,null,null,null,null,null,{"$f":"IFERROR(INDEX(IDRefTable_Proposed[Fixt ID],AD261),\"\")","v":""}]
[null,null,null,null,null,null,null,null,null,null,null,null,null,null,null,null,null,null,null,null,null,null,null,null,null,null,null,null,null,251,{"$f":"IFERROR(INDEX(IDRefTable_Existing[Fixt ID],AD262),\"\")","v":""},null,null,null,null,null,null,null,null,null,null,{"$f":"IFERROR(INDEX(IDRefTable_Proposed[Fixt ID],AD262),\"\")","v":""}]
[null,null,null,null,null,null,null,null,null,null,null,null,null,null,null,null,null,null,null,null,null,null,null,null,null,null,null,null,null,252,{"$f":"IFERROR(INDEX(IDRefTable_Existing[Fixt ID],AD263),\"\")","v":""},null,null,null,null,null,null,null,null,null,null,{"$f":"IFERROR(INDEX(IDRefTable_Proposed[Fixt ID],AD263),\"\")","v":""}]
[null,null,null,null,null,null,null,null,null,null,null,null,null,null,null,null,null,null,null,null,null,null,null,null,null,null,null,null,null,253,{"$f":"IFERROR(INDEX(IDRefTable_Existing[Fixt ID],AD264),\"\")","v":""},null,null,null,null,null,null,null,null,null,null,{"$f":"IFERROR(INDEX(IDRefTable_Proposed[Fixt ID],AD264),\"\")","v":""}]
[null,null,null,null,null,null,null,null,null,null,null,null,null,null,null,null,null,null,null,null,null,null,null,null,null,null,null,null,null,254,{"$f":"IFERROR(INDEX(IDRefTable_Existing[Fixt ID],AD265),\"\")","v":""},null,null,null,null,null,null,null,null,null,null,{"$f":"IFERROR(INDEX(IDRefTable_Proposed[Fixt ID],AD265),\"\")","v":""}]
[null,null,null,null,null,null,null,null,null,null,null,null,null,null,null,null,null,null,null,null,null,null,null,null,null,null,null,null,null,255,{"$f":"IFERROR(INDEX(IDRefTable_Existing[Fixt ID],AD266),\"\")","v":""},null,null,null,null,null,null,null,null,null,null,{"$f":"IFERROR(INDEX(IDRefTable_Proposed[Fixt ID],AD266),\"\")","v":""}]
[null,null,null,null,null,null,null,null,null,null,null,null,null,null,null,null,null,null,null,null,null,null,null,null,null,null,null,null,null,256,{"$f":"IFERROR(INDEX(IDRefTable_Existing[Fixt ID],AD267),\"\")","v":""},null,null,null,null,null,null,null,null,null,null,{"$f":"IFERROR(INDEX(IDRefTable_Proposed[Fixt ID],AD267),\"\")","v":""}]
[null,null,null,null,null,null,null,null,null,null,null,null,null,null,null,null,null,null,null,null,null,null,null,null,null,null,null,null,null,257,{"$f":"IFERROR(INDEX(IDRefTable_Existing[Fixt ID],AD268),\"\")","v":""},null,null,null,null,null,null,null,null,null,null,{"$f":"IFERROR(INDEX(IDRefTable_Proposed[Fixt ID],AD268),\"\")","v":""}]
[null,null,null,null,null,null,null,null,null,null,null,null,null,null,null,null,null,null,null,null,null,null,null,null,null,null,null,null,null,258,{"$f":"IFERROR(INDEX(IDRefTable_Existing[Fixt ID],AD269),\"\")","v":""},null,null,null,null,null,null,null,null,null,null,{"$f":"IFERROR(INDEX(IDRefTable_Proposed[Fixt ID],AD269),\"\")","v":""}]
[null,null,null,null,null,null,null,null,null,null,null,null,null,null,null,null,null,null,null,null,null,null,null,null,null,null,null,null,null,259,{"$f":"IFERROR(INDEX(IDRefTable_Existing[Fixt ID],AD270),\"\")","v":""},null,null,null,null,null,null,null,null,null,null,{"$f":"IFERROR(INDEX(IDRefTable_Proposed[Fixt ID],AD270),\"\")","v":""}]
[null,null,null,null,null,null,null,null,null,null,null,null,null,null,null,null,null,null,null,null,null,null,null,null,null,null,null,null,null,260,{"$f":"IFERROR(INDEX(IDRefTable_Existing[Fixt ID],AD271),\"\")","v":""},null,null,null,null,null,null,null,null,null,null,{"$f":"IFERROR(INDEX(IDRefTable_Proposed[Fixt ID],AD271),\"\")","v":""}]
[null,null,null,null,null,null,null,null,null,null,null,null,null,null,null,null,null,null,null,null,null,null,null,null,null,null,null,null,null,261,{"$f":"IFERROR(INDEX(IDRefTable_Existing[Fixt ID],AD272),\"\")","v":""},null,null,null,null,null,null,null,null,null,null,{"$f":"IFERROR(INDEX(IDRefTable_Proposed[Fixt ID],AD272),\"\")","v":""}]
[null,null,null,null,null,null,null,null,null,null,null,null,null,null,null,null,null,null,null,null,null,null,null,null,null,null,null,null,null,262,{"$f":"IFERROR(INDEX(IDRefTable_Existing[Fixt ID],AD273),\"\")","v":""},null,null,null,null,null,null,null,null,null,null,{"$f":"IFERROR(INDEX(IDRefTable_Proposed[Fixt ID],AD273),\"\")","v":""}]
[null,null,null,null,null,null,null,null,null,null,null,null,null,null,null,null,null,null,null,null,null,null,null,null,null,null,null,null,null,263,{"$f":"IFERROR(INDEX(IDRefTable_Existing[Fixt ID],AD274),\"\")","v":""},null,null,null,null,null,null,null,null,null,null,{"$f":"IFERROR(INDEX(IDRefTable_Proposed[Fixt ID],AD274),\"\")","v":""}]
[null,null,null,null,null,null,null,null,null,null,null,null,null,null,null,null,null,null,null,null,null,null,null,null,null,null,null,null,null,264,{"$f":"IFERROR(INDEX(IDRefTable_Existing[Fixt ID],AD275),\"\")","v":""},null,null,null,null,null,null,null,null,null,null,{"$f":"IFERROR(INDEX(IDRefTable_Proposed[Fixt ID],AD275),\"\")","v":""}]
[null,null,null,null,null,null,null,null,null,null,null,null,null,null,null,null,null,null,null,null,null,null,null,null,null,null,null,null,null,265,{"$f":"IFERROR(INDEX(IDRefTable_Existing[Fixt ID],AD276),\"\")","v":""},null,null,null,null,null,null,null,null,null,null,{"$f":"IFERROR(INDEX(IDRefTable_Proposed[Fixt ID],AD276),\"\")","v":""}]
[null,null,null,null,null,null,null,null,null,null,null,null,null,null,null,null,null,null,null,null,null,null,null,null,null,null,null,null,null,266,{"$f":"IFERROR(INDEX(IDRefTable_Existing[Fixt ID],AD277),\"\")","v":""},null,null,null,null,null,null,null,null,null,null,{"$f":"IFERROR(INDEX(IDRefTable_Proposed[Fixt ID],AD277),\"\")","v":""}]
[null,null,null,null,null,null,null,null,null,null,null,null,null,null,null,null,null,null,null,null,null,null,null,null,null,null,null,null,null,267,{"$f":"IFERROR(INDEX(IDRefTable_Existing[Fixt ID],AD278),\"\")","v":""},null,null,null,null,null,null,null,null,null,null,{"$f":"IFERROR(INDEX(IDRefTable_Proposed[Fixt ID],AD278),\"\")","v":""}]
[null,null,null,null,null,null,null,null,null,null,null,null,null,null,null,null,null,null,null,null,null,null,null,null,null,null,null,null,null,268,{"$f":"IFERROR(INDEX(IDRefTable_Existing[Fixt ID],AD279),\"\")","v":""},null,null,null,null,null,null,null,null,null,null,{"$f":"IFERROR(INDEX(IDRefTable_Proposed[Fixt ID],AD279),\"\")","v":""}]
[null,null,null,null,null,null,null,null,null,null,null,null,null,null,null,null,null,null,null,null,null,null,null,null,null,null,null,null,null,269,{"$f":"IFERROR(INDEX(IDRefTable_Existing[Fixt ID],AD280),\"\")","v":""},null,null,null,null,null,null,null,null,null,null,{"$f":"IFERROR(INDEX(IDRefTable_Proposed[Fixt ID],AD280),\"\")","v":""}]
[null,null,null,null,null,null,null,null,null,null,null,null,null,null,null,null,null,null,null,null,null,null,null,null,null,null,null,null,null,270,{"$f":"IFERROR(INDEX(IDRefTable_Existing[Fixt ID],AD281),\"\")","v":""},null,null,null,null,null,null,null,null,null,null,{"$f":"IFERROR(INDEX(IDRefTable_Proposed[Fixt ID],AD281),\"\")","v":""}]
[null,null,null,null,null,null,null,null,null,null,null,null,null,null,null,null,null,null,null,null,null,null,null,null,null,null,null,null,null,271,{"$f":"IFERROR(INDEX(IDRefTable_Existing[Fixt ID],AD282),\"\")","v":""},null,null,null,null,null,null,null,null,null,null,{"$f":"IFERROR(INDEX(IDRefTable_Proposed[Fixt ID],AD282),\"\")","v":""}]
[null,null,null,null,null,null,null,null,null,null,null,null,null,null,null,null,null,null,null,null,null,null,null,null,null,null,null,null,null,272,{"$f":"IFERROR(INDEX(IDRefTable_Existing[Fixt ID],AD283),\"\")","v":""},null,null,null,null,null,null,null,null,null,null,{"$f":"IFERROR(INDEX(IDRefTable_Proposed[Fixt ID],AD283),\"\")","v":""}]
[null,null,null,null,null,null,null,null,null,null,null,null,null,null,null,null,null,null,null,null,null,null,null,null,null,null,null,null,null,273,{"$f":"IFERROR(INDEX(IDRefTable_Existing[Fixt ID],AD284),\"\")","v":""},null,null,null,null,null,null,null,null,null,null,{"$f":"IFERROR(INDEX(IDRefTable_Proposed[Fixt ID],AD284),\"\")","v":""}]
[null,null,null,null,null,null,null,null,null,null,null,null,null,null,null,null,null,null,null,null,null,null,null,null,null,null,null,null,null,274,{"$f":"IFERROR(INDEX(IDRefTable_Existing[Fixt ID],AD285),\"\")","v":""},null,null,null,null,null,null,null,null,null,null,{"$f":"IFERROR(INDEX(IDRefTable_Proposed[Fixt ID],AD285),\"\")","v":""}]
[null,null,null,null,null,null,null,null,null,null,null,null,null,null,null,null,null,null,null,null,null,null,null,null,null,null,null,null,null,275,{"$f":"IFERROR(INDEX(IDRefTable_Existing[Fixt ID],AD286),\"\")","v":""},null,null,null,null,null,null,null,null,null,null,{"$f":"IFERROR(INDEX(IDRefTable_Proposed[Fixt ID],AD286),\"\")","v":""}]
[null,null,null,null,null,null,null,null,null,null,null,null,null,null,null,null,null,null,null,null,null,null,null,null,null,null,null,null,null,276,{"$f":"IFERROR(INDEX(IDRefTable_Existing[Fixt ID],AD287),\"\")","v":""},null,null,null,null,null,null,null,null,null,null,{"$f":"IFERROR(INDEX(IDRefTable_Proposed[Fixt ID],AD287),\"\")","v":""}]
[null,null,null,null,null,null,null,null,null,null,null,null,null,null,null,null,null,null,null,null,null,null,null,null,null,null,null,null,null,277,{"$f":"IFERROR(INDEX(IDRefTable_Existing[Fixt ID],AD288),\"\")","v":""},null,null,null,null,null,null,null,null,null,null,{"$f":"IFERROR(INDEX(IDRefTable_Proposed[Fixt ID],AD288),\"\")","v":""}]
[null,null,null,null,null,null,null,null,null,null,null,null,null,null,null,null,null,null,null,null,null,null,null,null,null,null,null,null,null,278,{"$f":"IFERROR(INDEX(IDRefTable_Existing[Fixt ID],AD289),\"\")","v":""},null,null,null,null,null,null,null,null,null,null,{"$f":"IFERROR(INDEX(IDRefTable_Proposed[Fixt ID],AD289),\"\")","v":""}]
[null,null,null,null,null,null,null,null,null,null,null,null,null,null,null,null,null,null,null,null,null,null,null,null,null,null,null,null,null,279,{"$f":"IFERROR(INDEX(IDRefTable_Existing[Fixt ID],AD290),\"\")","v":""},null,null,null,null,null,null,null,null,null,null,{"$f":"IFERROR(INDEX(IDRefTable_Proposed[Fixt ID],AD290),\"\")","v":""}]
[null,null,null,null,null,null,null,null,null,null,null,null,null,null,null,null,null,null,null,null,null,null,null,null,null,null,null,null,null,280,{"$f":"IFERROR(INDEX(IDRefTable_Existing[Fixt ID],AD291),\"\")","v":""},null,null,null,null,null,null,null,null,null,null,{"$f":"IFERROR(INDEX(IDRefTable_Proposed[Fixt ID],AD291),\"\")","v":""}]
[null,null,null,null,null,null,null,null,null,null,null,null,null,null,null,null,null,null,null,null,null,null,null,null,null,null,null,null,null,281,{"$f":"IFERROR(INDEX(IDRefTable_Existing[Fixt ID],AD292),\"\")","v":""},null,null,null,null,null,null,null,null,null,null,{"$f":"IFERROR(INDEX(IDRefTable_Proposed[Fixt ID],AD292),\"\")","v":""}]
[null,null,null,null,null,null,null,null,null,null,null,null,null,null,null,null,null,null,null,null,null,null,null,null,null,null,null,null,null,282,{"$f":"IFERROR(INDEX(IDRefTable_Existing[Fixt ID],AD293),\"\")","v":""},null,null,null,null,null,null,null,null,null,null,{"$f":"IFERROR(INDEX(IDRefTable_Proposed[Fixt ID],AD293),\"\")","v":""}]
[null,null,null,null,null,null,null,null,null,null,null,null,null,null,null,null,null,null,null,null,null,null,null,null,null,null,null,null,null,283,{"$f":"IFERROR(INDEX(IDRefTable_Existing[Fixt ID],AD294),\"\")","v":""},null,null,null,null,null,null,null,null,null,null,{"$f":"IFERROR(INDEX(IDRefTable_Proposed[Fixt ID],AD294),\"\")","v":""}]
[null,null,null,null,null,null,null,null,null,null,null,null,null,null,null,null,null,null,null,null,null,null,null,null,null,null,null,null,null,284,{"$f":"IFERROR(INDEX(IDRefTable_Existing[Fixt ID],AD295),\"\")","v":""},null,null,null,null,null,null,null,null,null,null,{"$f":"IFERROR(INDEX(IDRefTable_Proposed[Fixt ID],AD295),\"\")","v":""}]
[null,null,null,null,null,null,null,null,null,null,null,null,null,null,null,null,null,null,null,null,null,null,null,null,null,null,null,null,null,285,{"$f":"IFERROR(INDEX(IDRefTable_Existing[Fixt ID],AD296),\"\")","v":""},null,null,null,null,null,null,null,null,null,null,{"$f":"IFERROR(INDEX(IDRefTable_Proposed[Fixt ID],AD296),\"\")","v":""}]
[null,null,null,null,null,null,null,null,null,null,null,null,null,null,null,null,null,null,null,null,null,null,null,null,null,null,null,null,null,286,{"$f":"IFERROR(INDEX(IDRefTable_Existing[Fixt ID],AD297),\"\")","v":""},null,null,null,null,null,null,null,null,null,null,{"$f":"IFERROR(INDEX(IDRefTable_Proposed[Fixt ID],AD297),\"\")","v":""}]
[null,null,null,null,null,null,null,null,null,null,null,null,null,null,null,null,null,null,null,null,null,null,null,null,null,null,null,null,null,287,{"$f":"IFERROR(INDEX(IDRefTable_Existing[Fixt ID],AD298),\"\")","v":""},null,null,null,null,null,null,null,null,null,null,{"$f":"IFERROR(INDEX(IDRefTable_Proposed[Fixt ID],AD298),\"\")","v":""}]
[null,null,null,null,null,null,null,null,null,null,null,null,null,null,null,null,null,null,null,null,null,null,null,null,null,null,null,null,null,288,{"$f":"IFERROR(INDEX(IDRefTable_Existing[Fixt ID],AD299),\"\")","v":""},null,null,null,null,null,null,null,null,null,null,{"$f":"IFERROR(INDEX(IDRefTable_Proposed[Fixt ID],AD299),\"\")","v":""}]
[null,null,null,null,null,null,null,null,null,null,null,null,null,null,null,null,null,null,null,null,null,null,null,null,null,null,null,null,null,289,{"$f":"IFERROR(INDEX(IDRefTable_Existing[Fixt ID],AD300),\"\")","v":""},null,null,null,null,null,null,null,null,null,null,{"$f":"IFERROR(INDEX(IDRefTable_Proposed[Fixt ID],AD300),\"\")","v":""}]
[null,null,null,null,null,null,null,null,null,null,null,null,null,null,null,null,null,null,null,null,null,null,null,null,null,null,null,null,null,290,{"$f":"IFERROR(INDEX(IDRefTable_Existing[Fixt ID],AD301),\"\")","v":""},null,null,null,null,null,null,null,null,null,null,{"$f":"IFERROR(INDEX(IDRefTable_Proposed[Fixt ID],AD301),\"\")","v":""}]
[null,null,null,null,null,null,null,null,null,null,null,null,null,null,null,null,null,null,null,null,null,null,null,null,null,null,null,null,null,291,{"$f":"IFERROR(INDEX(IDRefTable_Existing[Fixt ID],AD302),\"\")","v":""},null,null,null,null,null,null,null,null,null,null,{"$f":"IFERROR(INDEX(IDRefTable_Proposed[Fixt ID],AD302),\"\")","v":""}]
[null,null,null,null,null,null,null,null,null,null,null,null,null,null,null,null,null,null,null,null,null,null,null,null,null,null,null,null,null,292,{"$f":"IFERROR(INDEX(IDRefTable_Existing[Fixt ID],AD303),\"\")","v":""},null,null,null,null,null,null,null,null,null,null,{"$f":"IFERROR(INDEX(IDRefTable_Proposed[Fixt ID],AD303),\"\")","v":""}]
[null,null,null,null,null,null,null,null,null,null,null,null,null,null,null,null,null,null,null,null,null,null,null,null,null,null,null,null,null,293,{"$f":"IFERROR(INDEX(IDRefTable_Existing[Fixt ID],AD304),\"\")","v":""},null,null,null,null,null,null,null,null,null,null,{"$f":"IFERROR(INDEX(IDRefTable_Proposed[Fixt ID],AD304),\"\")","v":""}]
[null,null,null,null,null,null,null,null,null,null,null,null,null,null,null,null,null,null,null,null,null,null,null,null,null,null,null,null,null,294,{"$f":"IFERROR(INDEX(IDRefTable_Existing[Fixt ID],AD305),\"\")","v":""},null,null,null,null,null,null,null,null,null,null,{"$f":"IFERROR(INDEX(IDRefTable_Proposed[Fixt ID],AD305),\"\")","v":""}]
[null,null,null,null,null,null,null,null,null,null,null,null,null,null,null,null,null,null,null,null,null,null,null,null,null,null,null,null,null,295,{"$f":"IFERROR(INDEX(IDRefTable_Existing[Fixt ID],AD306),\"\")","v":""},null,null,null,null,null,null,null,null,null,null,{"$f":"IFERROR(INDEX(IDRefTable_Proposed[Fixt ID],AD306),\"\")","v":""}]
[null,null,null,null,null,null,null,null,null,null,null,null,null,null,null,null,null,null,null,null,null,null,null,null,null,null,null,null,null,296,{"$f":"IFERROR(INDEX(IDRefTable_Existing[Fixt ID],AD307),\"\")","v":""},null,null,null,null,null,null,null,null,null,null,{"$f":"IFERROR(INDEX(IDRefTable_Proposed[Fixt ID],AD307),\"\")","v":""}]
[null,null,null,null,null,null,null,null,null,null,null,null,null,null,null,null,null,null,null,null,null,null,null,null,null,null,null,null,null,297,{"$f":"IFERROR(INDEX(IDRefTable_Existing[Fixt ID],AD308),\"\")","v":""},null,null,null,null,null,null,null,null,null,null,{"$f":"IFERROR(INDEX(IDRefTable_Proposed[Fixt ID],AD308),\"\")","v":""}]
[null,null,null,null,null,null,null,null,null,null,null,null,null,null,null,null,null,null,null,null,null,null,null,null,null,null,null,null,null,298,{"$f":"IFERROR(INDEX(IDRefTable_Existing[Fixt ID],AD309),\"\")","v":""},null,null,null,null,null,null,null,null,null,null,{"$f":"IFERROR(INDEX(IDRefTable_Proposed[Fixt ID],AD309),\"\")","v":""}]
[null,null,null,null,null,null,null,null,null,null,null,null,null,null,null,null,null,null,null,null,null,null,null,null,null,null,null,null,null,299,{"$f":"IFERROR(INDEX(IDRefTable_Existing[Fixt ID],AD310),\"\")","v":""},null,null,null,null,null,null,null,null,null,null,{"$f":"IFERROR(INDEX(IDRefTable_Proposed[Fixt ID],AD310),\"\")","v":""}]
[null,null,null,null,null,null,null,null,null,null,null,null,null,null,null,null,null,null,null,null,null,null,null,null,null,null,null,null,null,300,{"$f":"IFERROR(INDEX(IDRefTable_Existing[Fixt ID],AD311),\"\")","v":""},null,null,null,null,null,null,null,null,null,null,{"$f":"IFERROR(INDEX(IDRefTable_Proposed[Fixt ID],AD311),\"\")","v":""}]

{"sheet":"Rebate Tables","index":12,"n_rows":505,"n_cols":43,"rows_kept":505,"cut":false,"hidden":true,"merged":[[70,32,73,32],[74,32,77,32],[78,32,81,32],[82,32,85,32],[86,32,89,32],[90,32,93,32],[94,32,97,32],[98,32,101,32],[102,32,105,32],[34,32,37,32],[38,32,41,32],[42,32,45,32],[46,32,49,32],[50,32,53,32],[54,32,57,32],[58,32,61,32],[62,32,65,32],[66,32,69,32],[429,25,431,25],[432,25,434,25],[435,25,437,25],[438,25,440,25],[441,25,443,25],[444,25,446,25],[447,25,449,25],[414,25,416,25],[417,25,419,25],[420,25,422,25],[423,25,425,25],[426,25,428,25],[396,25,398,25],[399,25,401,25],[402,25,404,25],[405,25,407,25],[408,25,410,25],[411,25,413,25],[378,25,380,25],[381,25,383,25],[384,25,386,25],[387,25,389,25],[390,25,392,25],[393,25,395,25],[6,32,9,32],[10,32,13,32],[14,32,17,32],[18,32,21,32],[22,32,25,32],[26,32,29,32],[30,32,33,32],[288,25,290,25],[291,25,293,25],[126,25,128,25],[129,25,131,25],[132,25,134,25],[135,25,137,25],[138,25,140,25],[141,25,143,25],[81,25,83,25],[90,25,92,25],[93,25,95,25],[96,25,98,25],[99,25,101,25],[102,25,104,25],[84,25,86,25],[87,25,89,25],[105,25,107,25],[294,25,296,25],[144,25,146,25],[162,25,164,25],[261,25,263,25],[264,25,266,25],[165,25,167,25],[168,25,170,25],[171,25,173,25],[174,25,176,25],[147,25,149,25],[150,25,152,25],[153,25,155,25],[156,25,158,25],[159,25,161,25],[195,25,197,25],[198,25,200,25],[201,25,203,25],[204,25,206,25],[207,25,209,25],[228,25,230,25],[231,25,233,25],[234,25,236,25],[237,25,239,25],[240,25,242,25],[333,25,335,25],[336,25,338,25],[339,25,341,25],[363,25,365,25],[366,25,368,25],[369,25,371,25],[372,25,374,25],[375,25,377,25],[357,25,359,25],[360,25,362,25],[348,25,350,25],[351,25,353,25],[354,25,356,25],[72,25,74,25],[75,25,77,25],[78,25,80,25],[315,25,317,25],[318,25,320,25],[321,25,323,25],[324,25,326,25],[342,25,344,25],[345,25,347,25],[267,25,269,25],[270,25,272,25],[297,25,299,25],[273,25,275,25],[276,25,278,25],[279,25,281,25],[282,25,284,25],[285,25,287,25],[300,25,302,25],[303,25,305,25],[306,25,308,25],[309,25,311,25],[312,25,314,25],[327,25,329,25],[330,25,332,25],[24,25,26,25],[27,25,29,25],[51,25,53,25],[54,25,56,25],[57,25,59,25],[60,25,62,25],[6,25,8,25],[9,25,11,25],[12,25,14,25],[15,25,17,25],[18,25,20,25],[21,25,23,25],[63,25,65,25],[66,25,68,25],[69,25,71,25],[30,25,32,25],[33,25,35,25],[36,25,38,25],[39,25,41,25],[42,25,44,25],[45,25,47,25],[48,25,50,25],[106,32,109,32],[110,32,113,32],[177,25,179,25],[180,25,182,25],[183,25,185,25],[186,25,188,25],[189,25,191,25],[192,25,194,25],[210,25,212,25],[108,25,110,25],[111,25,113,25],[114,25,116,25],[117,25,119,25],[120,25,122,25],[123,25,125,25],[114,32,117,32],[118,32,121,32],[122,32,125,32],[126,32,129,32],[130,32,133,32],[134,32,137,32],[138,32,141,32],[142,32,145,32],[146,32,149,32],[255,25,257,25],[258,25,260,25],[213,25,215,25],[216,25,218,25],[219,25,221,25],[222,25,224,25],[225,25,227,25],[243,25,245,25],[246,25,248,25],[249,25,251,25],[252,25,254,25]]}
[]
[null,"Rebate Tables"]
[]
[null,"Wattage Reduction LookUp Table",null,null,null,null,null,null,null,null,null,null,null,null,null,null,null,null,null,null,null,null,null,null,null,"Lighting Rebate LookUp Table",null,null,null,null,null,null,"Controls LookUp Table",null,null,null,null,null,null,null,null,"Removal LookUp Table"]
[null,"WattageReduction","N","NWattRange","4'T12-L","LWattRange","8'T12-L","LWattRange","L","LWattRange","LL","LWattRange","H","HWattRange","HL","HWattRange","O","OWattRange","OL","OWattRange","E","EWattRange","C","CWattRange",null,"Category","Code",null,null,null,null,null,"Category","Code","Rebate / Fixt","Rebate / Sensor","Rebate / Fixt","Rebate / Sensor","Rebate / Fixt","Rebate / Sensor",null,"Code","Rebate"]
[null,1,0,null,0,null,0,null,0,null,0,null,0,null,0,null,0,null,0,null,null,null,1,"(1-10)",null,null,"-",2025,2024,2023,2022,null,null,"-",2025,2025,2024,2024,"2022-23","2022-23",null,"RN",15]
[null,2,0,null,0,null,0,null,0,null,0,null,0,null,0,null,0,null,0,null,null,null,1,"(1-10)",null,"NL1","NL1T1A",0,0,0,0,null,"C1","C1T0",{"$f":"AK7","v":4},{"$f":"AL7","v":50},4,50,3,40,null,"RL",20]
[null,3,0,null,0,null,0,null,0,null,1,"(>3)",0,null,0,null,0,null,0,null,null,null,1,"(1-10)",null,null,"NL1T2A",0,0,0,0,null,null,"C1T1",{"$f":"AK8","v":4},50,4,50,3,40,null,"R4'T12-L",20]
[null,4,0,null,0,null,0,null,0,null,1,"(>3)",0,null,0,null,0,null,0,null,null,null,1,"(1-10)",null,null,"NL1T3A",0,0,0,0,null,null,"C1T2",4,50,4,50,3,40,null,"R8'T12-L",20]
[null,5,1,"(5-15)",0,null,0,null,1,"(5-15)",1,"(>3)",0,null,0,null,1,"(5-100)",1,"(5-100)",null,null,1,"(1-10)",null,"NL2","NL2T1A",0,0,0,0,null,null,"C1T3",4,50,4,50,3,40,null,"RH",40]
[null,6,1,"(5-15)",0,null,0,null,1,"(5-15)",1,"(>3)",0,null,0,null,1,"(5-100)",1,"(5-100)",null,null,1,"(1-10)",null,null,"NL2T2A",0,0,0,0,null,"C2","C2T0",4,50,4,50,3,40,null,"RO",20]
[null,7,1,"(5-15)",0,null,0,null,1,"(5-15)",1,"(>3)",0,null,0,null,1,"(5-100)",1,"(5-100)",null,null,1,"(1-10)",null,null,"NL2T3A",0,0,0,0,null,"","C2T1",4,50,4,50,3,40]
[null,8,1,"(5-15)",0,null,0,null,1,"(5-15)",1,"(>3)",0,null,0,null,1,"(5-100)",1,"(5-100)",null,null,1,"(1-10)",null,"NL3","NL3T1A",0,0,0,0,null,"","C2T2",6,50,6,50,5,40]
[null,9,1,"(5-15)",0,null,0,null,1,"(5-15)",1,"(>3)",0,null,0,null,1,"(5-100)",1,"(5-100)",null,null,1,"(1-10)",null,null,"NL3T2A",0,0,0,0,null,"","C2T3",6,50,6,50,5,40]
[null,10,1,"(5-15)",0,null,0,null,1,"(5-15)",1,"(>3)",1,"(10-50)",1,"(10-100)",1,"(5-100)",1,"(5-100)","S","(>10)",1,"(1-10)",null,null,"NL3T3A",0,0,0,0,null,"C3","C3T0",6,50,6,50,5,40]
[null,11,1,"(5-15)",0,null,0,null,1,"(5-15)",1,"(>3)",1,"(10-50)",1,"(10-100)",1,"(5-100)",1,"(5-100)","S","(>10)",2,"(11-20)",null,"NL4","NL4T1A",0,0,0,0,null,"","C3T1",6,50,6,50,5,40]
[null,12,1,"(5-15)",0,null,0,null,1,"(5-15)",1,"(>3)",1,"(10-50)",1,"(10-100)",1,"(5-100)",1,"(5-100)","S","(>10)",2,"(11-20)",null,null,"NL4T2A",0,0,0,0,null,"","C3T2",7,50,7,50,6,40]
[null,13,1,"(5-15)",0,null,0,null,1,"(5-15)",1,"(>3)",1,"(10-50)",1,"(10-100)",1,"(5-100)",1,"(5-100)","S","(>10)",2,"(11-20)",null,null,"NL4T3A",0,0,0,0,null,"","C3T3",9,50,9,50,7,40]
[null,14,1,"(5-15)",0,null,0,null,1,"(5-15)",1,"(>3)",1,"(10-50)",1,"(10-100)",1,"(5-100)",1,"(5-100)","S","(>10)",2,"(11-20)",null,"NK1","NK1T1A",12,12,10,8,null,"C4","C4T0",7,50,7,50,6,40]
[null,15,1,"(5-15)",0,null,0,null,1,"(5-15)",1,"(>3)",1,"(10-50)",1,"(10-100)",1,"(5-100)",1,"(5-100)","S","(>10)",2,"(11-20)",null,null,"NK1T2A",16,16,14,11,null,"","C4T1",7,50,7,50,6,40]
[null,16,2,"(16-35)",0,null,0,null,2,"(16-30)",1,"(>3)",1,"(10-50)",1,"(10-100)",1,"(5-100)",1,"(5-100)","S","(>10)",2,"(11-20)",null,null,"NK1T3A",17,17,15,12,null,"","C4T2",10,50,10,50,8,40]
[null,17,2,"(16-35)",0,null,0,null,2,"(16-30)",1,"(>3)",1,"(10-50)",1,"(10-100)",1,"(5-100)",1,"(5-100)","S","(>10)",2,"(11-20)",null,"NK2","NK2T1A",28,28,24,19,null,"","C4T3",11,50,11,50,9,40]
[null,18,2,"(16-35)",0,null,0,null,2,"(16-30)",1,"(>3)",1,"(10-50)",1,"(10-100)",1,"(5-100)",1,"(5-100)","S","(>10)",2,"(11-20)",null,null,"NK2T2A",36,36,31,25,null,"C5","C5T0",9,50,9,50,7,40]
[null,19,2,"(16-35)",0,null,0,null,2,"(16-30)",1,"(>3)",1,"(10-50)",1,"(10-100)",1,"(5-100)",1,"(5-100)","S","(>10)",2,"(11-20)",null,null,"NK2T3A",41,41,36,29,null,"","C5T1",9,50,9,50,7,40]
[null,20,2,"(16-35)",1,"(20-40)",1,"(20-55)",2,"(16-30)",1,"(>3)",1,"(10-50)",1,"(10-100)",1,"(5-100)",1,"(5-100)","S","(>10)",2,"(11-20)",null,"NK3","NK3T1A",44,44,38,30,null,"","C5T2",11,50,11,50,9,40]
[null,21,2,"(16-35)",1,"(20-40)",1,"(20-55)",2,"(16-30)",1,"(>3)",1,"(10-50)",1,"(10-100)",1,"(5-100)",1,"(5-100)","S","(>10)",3,"(21-30)",null,null,"NK3T2A",59,59,51,41,null,"","C5T3",12,50,12,50,10,40]
[null,22,2,"(16-35)",1,"(20-40)",1,"(20-55)",2,"(16-30)",1,"(>3)",1,"(10-50)",1,"(10-100)",1,"(5-100)",1,"(5-100)","S","(>10)",3,"(21-30)",null,null,"NK3T3A",68,68,59,47,null,"C6","C6T0",10,50,10,50,8,40]
[null,23,2,"(16-35)",1,"(20-40)",1,"(20-55)",2,"(16-30)",1,"(>3)",1,"(10-50)",1,"(10-100)",1,"(5-100)",1,"(5-100)","S","(>10)",3,"(21-30)",null,"NK4","NK4T1A",58,58,50,40,null,"","C6T1",10,50,10,50,8,40]
[null,24,2,"(16-35)",1,"(20-40)",1,"(20-55)",2,"(16-30)",1,"(>3)",1,"(10-50)",1,"(10-100)",1,"(5-100)",1,"(5-100)","S","(>10)",3,"(21-30)",null,null,"NK4T2A",76,76,66,53,null,"","C6T2",13,50,13,50,11,40]
[null,25,2,"(16-35)",1,"(20-40)",1,"(20-55)",2,"(16-30)",1,"(>3)",1,"(10-50)",1,"(10-100)",1,"(5-100)",1,"(5-100)","S","(>10)",3,"(21-30)",null,null,"NK4T3A",87,87,76,61,null,"","C6T3",14,50,14,50,12,40]
[null,26,2,"(16-35)",1,"(20-40)",1,"(20-55)",2,"(16-30)",1,"(>3)",1,"(10-50)",1,"(10-100)",1,"(5-100)",1,"(5-100)","S","(>10)",3,"(21-30)",null,"NK5","NK5T1A",102,102,89,71,null,"C7","C7T0",12,50,12,50,10,40]
[null,27,2,"(16-35)",1,"(20-40)",1,"(20-55)",2,"(16-30)",1,"(>3)",1,"(10-50)",1,"(10-100)",1,"(5-100)",1,"(5-100)","S","(>10)",3,"(21-30)",null,null,"NK5T2A",138,138,120,96,null,"","C7T1",12,50,12,50,10,40]
[null,28,2,"(16-35)",1,"(20-40)",1,"(20-55)",2,"(16-30)",1,"(>3)",1,"(10-50)",1,"(10-100)",1,"(5-100)",1,"(5-100)","S","(>10)",3,"(21-30)",null,null,"NK5T3A",156,156,136,109,null,"","C7T2",17,50,17,50,14,40]
[null,29,2,"(16-35)",1,"(20-40)",1,"(20-55)",2,"(16-30)",1,"(>3)",1,"(10-50)",1,"(10-100)",1,"(5-100)",1,"(5-100)","S","(>10)",3,"(21-30)",null,"NK6","NK6T1A",137,137,119,95,null,"","C7T3",19,50,19,50,16,40]
[null,30,2,"(16-35)",1,"(20-40)",1,"(20-55)",2,"(16-30)",1,"(>3)",1,"(10-50)",1,"(10-100)",1,"(5-100)",1,"(5-100)","S","(>10)",3,"(21-30)",null,null,"NK6T2A",184,184,160,128,null,"C8","C8T0",15,50,15,50,13,40]
[null,31,2,"(16-35)",1,"(20-40)",1,"(20-55)",3,"(31-50)",1,"(>3)",1,"(10-50)",1,"(10-100)",1,"(5-100)",1,"(5-100)","S","(>10)",4,"(31-40)",null,null,"NK6T3A",210,210,183,146,null,"","C8T1",15,50,15,50,13,40]
[null,32,2,"(16-35)",1,"(20-40)",1,"(20-55)",3,"(31-50)",1,"(>3)",1,"(10-50)",1,"(10-100)",1,"(5-100)",1,"(5-100)","S","(>10)",4,"(31-40)",null,"NK7","NK7T1A",145,145,126,101,null,"","C8T2",21,50,21,50,18,40]
[null,33,2,"(16-35)",1,"(20-40)",1,"(20-55)",3,"(31-50)",1,"(>3)",1,"(10-50)",1,"(10-100)",1,"(5-100)",1,"(5-100)","S","(>10)",4,"(31-40)",null,null,"NK7T2A",199,199,173,138,null,"","C8T3",23,50,23,50,20,40]
[null,34,2,"(16-35)",1,"(20-40)",1,"(20-55)",3,"(31-50)",1,"(>3)",1,"(10-50)",1,"(10-100)",1,"(5-100)",1,"(5-100)","S","(>10)",4,"(31-40)",null,null,"NK7T3A",224,224,195,156,null,"C9","C9T0",21,50,21,50,18,40]
[null,35,2,"(16-35)",1,"(20-40)",1,"(20-55)",3,"(31-50)",1,"(>3)",1,"(10-50)",1,"(10-100)",1,"(5-100)",1,"(5-100)","S","(>10)",4,"(31-40)",null,"NK8","NK8T1A",148,148,129,103,null,"","C9T1",21,50,21,50,18,40]
[null,36,3,"(36-55)",1,"(20-40)",1,"(20-55)",3,"(31-50)",1,"(>3)",1,"(10-50)",1,"(10-100)",1,"(5-100)",1,"(5-100)","S","(>10)",4,"(31-40)",null,null,"NK8T2A",200,200,174,139,null,"","C9T2",28,50,28,50,24,40]
[null,37,3,"(36-55)",1,"(20-40)",1,"(20-55)",3,"(31-50)",1,"(>3)",1,"(10-50)",1,"(10-100)",1,"(5-100)",1,"(5-100)","S","(>10)",4,"(31-40)",null,null,"NK8T3A",229,229,199,159,null,"","C9T3",32,50,32,50,27,40]
[null,38,3,"(36-55)",1,"(20-40)",1,"(20-55)",3,"(31-50)",1,"(>3)",1,"(10-50)",1,"(10-100)",1,"(5-100)",1,"(5-100)","S","(>10)",4,"(31-40)",null,"NK9","NK9T1A",156,156,136,109,null,"CA1","CA1T0",{"$f":"AK43","v":4},70,4,70,3,60]
[null,39,3,"(36-55)",1,"(20-40)",1,"(20-55)",3,"(31-50)",1,"(>3)",1,"(10-50)",1,"(10-100)",1,"(5-100)",1,"(5-100)","S","(>10)",4,"(31-40)",null,null,"NK9T2A",210,210,183,146,null,"","CA1T1",4,70,4,70,3,60]
[null,40,3,"(36-55)",1,"(20-40)",1,"(20-55)",3,"(31-50)",1,"(>3)",1,"(10-50)",1,"(10-100)",1,"(5-100)",1,"(5-100)","S","(>10)",4,"(31-40)",null,null,"NK9T3A",242,242,210,168,null,"","CA1T2",6,70,6,70,5,60]
[null,41,3,"(36-55)",2,"(41-55)",1,"(20-55)",3,"(31-50)",1,"(>3)",1,"(10-50)",1,"(10-100)",1,"(5-100)",1,"(5-100)","S","(>10)",5,"(41-50)",null,"NK10","NK10T1A",161,161,140,112,null,"","CA1T3",6,70,6,70,5,60]
[null,42,3,"(36-55)",2,"(41-55)",1,"(20-55)",3,"(31-50)",1,"(>3)",1,"(10-50)",1,"(10-100)",1,"(5-100)",1,"(5-100)","S","(>10)",5,"(41-50)",null,null,"NK10T2A",217,217,189,151,null,"CA2","CA2T0",7,70,7,70,6,60]
[null,43,3,"(36-55)",2,"(41-55)",1,"(20-55)",3,"(31-50)",1,"(>3)",1,"(10-50)",1,"(10-100)",1,"(5-100)",1,"(5-100)","S","(>10)",5,"(41-50)",null,null,"NK10T3A",248,248,216,173,null,"","CA2T1",7,70,7,70,6,60]
[null,44,3,"(36-55)",2,"(41-55)",1,"(20-55)",3,"(31-50)",1,"(>3)",1,"(10-50)",1,"(10-100)",1,"(5-100)",1,"(5-100)","S","(>10)",5,"(41-50)",null,"NK11","NK11T1A",179,179,156,125,null,"","CA2T2",10,70,10,70,8,60]
[null,45,3,"(36-55)",2,"(41-55)",1,"(20-55)",3,"(31-50)",1,"(>3)",1,"(10-50)",1,"(10-100)",1,"(5-100)",1,"(5-100)","S","(>10)",5,"(41-50)",null,null,"NK11T2A",243,243,211,169,null,"","CA2T3",13,70,13,70,11,60]
[null,46,3,"(36-55)",2,"(41-55)",1,"(20-55)",3,"(31-50)",1,"(>3)",1,"(10-50)",1,"(10-100)",1,"(5-100)",1,"(5-100)","S","(>10)",5,"(41-50)",null,null,"NK11T3A",277,277,241,193,null,"CA3","CA3T0",9,70,9,70,7,60]
[null,47,3,"(36-55)",2,"(41-55)",1,"(20-55)",3,"(31-50)",1,"(>3)",1,"(10-50)",1,"(10-100)",1,"(5-100)",1,"(5-100)","S","(>10)",5,"(41-50)",null,"NF1","NF1T1A",15,15,13,10,null,"","CA3T1",9,70,9,70,7,60]
[null,48,3,"(36-55)",2,"(41-55)",1,"(20-55)",3,"(31-50)",1,"(>3)",1,"(10-50)",1,"(10-100)",1,"(5-100)",1,"(5-100)","S","(>10)",5,"(41-50)",null,null,"NF1T2A",21,21,18,14,null,"","CA3T2",12,70,12,70,10,60]
[null,49,3,"(36-55)",2,"(41-55)",1,"(20-55)",3,"(31-50)",1,"(>3)",1,"(10-50)",1,"(10-100)",1,"(5-100)",1,"(5-100)","S","(>10)",5,"(41-50)",null,null,"NF1T3A",22,22,19,15,null,"","CA3T3",17,70,17,70,14,60]
[null,50,3,"(36-55)",2,"(41-55)",1,"(20-55)",3,"(31-50)",1,"(>3)",1,"(10-50)",1,"(10-100)",1,"(5-100)",1,"(5-100)","S","(>10)",5,"(41-50)",null,"NF2","NF2T1A",35,35,30,24,null,"CA4","CA4T0",11,70,11,70,9,60]
[null,51,3,"(36-55)",2,"(41-55)",1,"(20-55)",4,"(51-70)",1,"(>3)",2,"(51-100)",1,"(10-100)",1,"(5-100)",1,"(5-100)","S","(>10)",6,"(51-60)",null,null,"NF2T2A",45,45,39,31,null,"","CA4T1",11,70,11,70,9,60]
[null,52,3,"(36-55)",2,"(41-55)",1,"(20-55)",4,"(51-70)",1,"(>3)",2,"(51-100)",1,"(10-100)",1,"(5-100)",1,"(5-100)","S","(>10)",6,"(51-60)",null,null,"NF2T3A",52,52,45,36,null,"","CA4T2",14,70,14,70,12,60]
[null,53,3,"(36-55)",2,"(41-55)",1,"(20-55)",4,"(51-70)",1,"(>3)",2,"(51-100)",1,"(10-100)",1,"(5-100)",1,"(5-100)","S","(>10)",6,"(51-60)",null,"NF3","NF3T1A",55,55,48,38,null,"","CA4T3",22,70,22,70,19,60]
[null,54,3,"(36-55)",2,"(41-55)",1,"(20-55)",4,"(51-70)",1,"(>3)",2,"(51-100)",1,"(10-100)",1,"(5-100)",1,"(5-100)","S","(>10)",6,"(51-60)",null,null,"NF3T2A",74,74,64,51,null,"CA5","CA5T0",13,70,13,70,11,60]
[null,55,3,"(36-55)",2,"(41-55)",1,"(20-55)",4,"(51-70)",1,"(>3)",2,"(51-100)",1,"(10-100)",1,"(5-100)",1,"(5-100)","S","(>10)",6,"(51-60)",null,null,"NF3T3A",85,85,74,59,null,"","CA5T1",13,70,13,70,11,60]
[null,56,4,"(56-100)",3,"(56-80)",2,"(56-100)",4,"(51-70)",1,"(>3)",2,"(51-100)",1,"(10-100)",1,"(5-100)",1,"(5-100)","S","(>10)",6,"(51-60)",null,"NF4","NF4T1A",72,72,63,50,null,"","CA5T2",18,70,18,70,15,60]
[null,57,4,"(56-100)",3,"(56-80)",2,"(56-100)",4,"(51-70)",1,"(>3)",2,"(51-100)",1,"(10-100)",1,"(5-100)",1,"(5-100)","S","(>10)",6,"(51-60)",null,null,"NF4T2A",95,95,83,66,null,"","CA5T3",26,70,26,70,22,60]
[null,58,4,"(56-100)",3,"(56-80)",2,"(56-100)",4,"(51-70)",1,"(>3)",2,"(51-100)",1,"(10-100)",1,"(5-100)",1,"(5-100)","S","(>10)",6,"(51-60)",null,null,"NF4T3A",109,109,95,76,null,"CA6","CA6T0",15,70,15,70,13,60]
[null,59,4,"(56-100)",3,"(56-80)",2,"(56-100)",4,"(51-70)",1,"(>3)",2,"(51-100)",1,"(10-100)",1,"(5-100)",1,"(5-100)","S","(>10)",6,"(51-60)",null,"NF5","NF5T1A",177,177,154,123,null,"","CA6T1",15,70,15,70,13,60]
[null,60,4,"(56-100)",3,"(56-80)",2,"(56-100)",4,"(51-70)",1,"(>3)",2,"(51-100)",1,"(10-100)",1,"(5-100)",1,"(5-100)","S","(>10)",6,"(51-60)",null,null,"NF5T2A",237,237,206,165,null,"","CA6T2",21,70,21,70,18,60]
[null,61,4,"(56-100)",3,"(56-80)",2,"(56-100)",4,"(51-70)",1,"(>3)",2,"(51-100)",1,"(10-100)",1,"(5-100)",1,"(5-100)","S","(>10)",7,"(61-80)",null,null,"NF5T3A",271,271,236,189,null,"","CA6T3",30,70,30,70,26,60]
[null,62,4,"(56-100)",3,"(56-80)",2,"(56-100)",4,"(51-70)",1,"(>3)",2,"(51-100)",1,"(10-100)",1,"(5-100)",1,"(5-100)","S","(>10)",7,"(61-80)",null,"NF6","NF6T1A",252,252,219,175,null,"CA7","CA7T0",20,70,20,70,17,60]
[null,63,4,"(56-100)",3,"(56-80)",2,"(56-100)",4,"(51-70)",1,"(>3)",2,"(51-100)",1,"(10-100)",1,"(5-100)",1,"(5-100)","S","(>10)",7,"(61-80)",null,null,"NF6T2A",338,338,294,235,null,"","CA7T1",20,70,20,70,17,60]
[null,64,4,"(56-100)",3,"(56-80)",2,"(56-100)",4,"(51-70)",1,"(>3)",2,"(51-100)",1,"(10-100)",1,"(5-100)",1,"(5-100)","S","(>10)",7,"(61-80)",null,null,"NF6T3A",386,386,336,269,null,"","CA7T2",27,70,27,70,23,60]
[null,65,4,"(56-100)",3,"(56-80)",2,"(56-100)",4,"(51-70)",1,"(>3)",2,"(51-100)",1,"(10-100)",1,"(5-100)",1,"(5-100)","S","(>10)",7,"(61-80)",null,"NF7","NF7T1A",289,289,251,201,null,"","CA7T3",38,70,38,70,33,60]
[null,66,4,"(56-100)",3,"(56-80)",2,"(56-100)",4,"(51-70)",1,"(>3)",2,"(51-100)",1,"(10-100)",1,"(5-100)",1,"(5-100)","S","(>10)",7,"(61-80)",null,null,"NF7T2A",392,392,341,273,null,"CA8","CA8T0",26,70,26,70,22,60]
[null,67,4,"(56-100)",3,"(56-80)",2,"(56-100)",4,"(51-70)",1,"(>3)",2,"(51-100)",1,"(10-100)",1,"(5-100)",1,"(5-100)","S","(>10)",7,"(61-80)",null,null,"NF7T3A",446,446,388,310,null,"","CA8T1",26,70,26,70,22,60]
[null,68,4,"(56-100)",3,"(56-80)",2,"(56-100)",4,"(51-70)",1,"(>3)",2,"(51-100)",1,"(10-100)",1,"(5-100)",1,"(5-100)","S","(>10)",7,"(61-80)",null,"NF8","NF8T1A",323,323,281,225,null,"","CA8T2",34,70,34,70,29,60]
[null,69,4,"(56-100)",3,"(56-80)",2,"(56-100)",4,"(51-70)",1,"(>3)",2,"(51-100)",1,"(10-100)",1,"(5-100)",1,"(5-100)","S","(>10)",7,"(61-80)",null,null,"NF8T2A",437,437,380,304,null,"","CA8T3",50,70,50,70,43,60]
[null,70,4,"(56-100)",3,"(56-80)",2,"(56-100)",4,"(51-70)",1,"(>3)",2,"(51-100)",1,"(10-100)",1,"(5-100)",1,"(5-100)","S","(>10)",7,"(61-80)",null,null,"NF8T3A",498,498,433,346,null,"CA9","CA9T0",34,70,34,70,29,60]
[null,71,4,"(56-100)",3,"(56-80)",2,"(56-100)",5,"(71-100)",1,"(>3)",2,"(51-100)",1,"(10-100)",1,"(5-100)",1,"(5-100)","S","(>10)",7,"(61-80)",null,"NF9","NF9T1A",351,351,305,244,null,"","CA9T1",34,70,34,70,29,60]
[null,72,4,"(56-100)",3,"(56-80)",2,"(56-100)",5,"(71-100)",1,"(>3)",2,"(51-100)",1,"(10-100)",1,"(5-100)",1,"(5-100)","S","(>10)",7,"(61-80)",null,null,"NF9T2A",475,475,413,330,null,"","CA9T2",45,70,45,70,39,60]
[null,73,4,"(56-100)",3,"(56-80)",2,"(56-100)",5,"(71-100)",1,"(>3)",2,"(51-100)",1,"(10-100)",1,"(5-100)",1,"(5-100)","S","(>10)",7,"(61-80)",null,null,"NF9T3A",541,541,470,376,null,"","CA9T3",66,70,66,70,57,60]
[null,74,4,"(56-100)",3,"(56-80)",2,"(56-100)",5,"(71-100)",1,"(>3)",2,"(51-100)",1,"(10-100)",1,"(5-100)",1,"(5-100)","S","(>10)",7,"(61-80)",null,"NF10","NF10T1A",374,374,325,260,null,"CN1","CN1T0",25,25,11,11,9,9]
[null,75,4,"(56-100)",3,"(56-80)",2,"(56-100)",5,"(71-100)",1,"(>3)",2,"(51-100)",1,"(10-100)",1,"(5-100)",1,"(5-100)","S","(>10)",7,"(61-80)",null,null,"NF10T2A",505,505,439,351,null,"","CN1T1",50,50,11,11,9,9]
[null,76,4,"(56-100)",3,"(56-80)",2,"(56-100)",5,"(71-100)",1,"(>3)",2,"(51-100)",1,"(10-100)",1,"(5-100)",1,"(5-100)","S","(>10)",7,"(61-80)",null,null,"NF10T3A",575,575,500,400,null,"","CN1T2",75,75,14,14,12,12]
[null,77,4,"(56-100)",3,"(56-80)",2,"(56-100)",5,"(71-100)",1,"(>3)",2,"(51-100)",1,"(10-100)",1,"(5-100)",1,"(5-100)","S","(>10)",7,"(61-80)",null,"NF11","NF11T1A",409,409,356,285,null,"","CN1T3",100,100,18,18,15,15]
[null,78,4,"(56-100)",3,"(56-80)",2,"(56-100)",5,"(71-100)",1,"(>3)",2,"(51-100)",1,"(10-100)",1,"(5-100)",1,"(5-100)","S","(>10)",7,"(61-80)",null,null,"NF11T2A",553,553,481,385,null,"CN2","CN2T0",25,25,29,29,25,25]
[null,79,4,"(56-100)",3,"(56-80)",2,"(56-100)",5,"(71-100)",1,"(>3)",2,"(51-100)",1,"(10-100)",1,"(5-100)",1,"(5-100)","S","(>10)",7,"(61-80)",null,null,"NF11T3A",631,631,549,439,null,"","CN2T1",50,50,29,29,25,25]
[null,80,4,"(56-100)",3,"(56-80)",2,"(56-100)",5,"(71-100)",1,"(>3)",2,"(51-100)",1,"(10-100)",1,"(5-100)",1,"(5-100)","S","(>10)",7,"(61-80)",null,"LL1","LL1T1A",1,1,1,1,null,"","CN2T2",75,75,38,38,33,33]
[null,81,4,"(56-100)",4,"(81-100)",2,"(56-100)",5,"(71-100)",1,"(>3)",2,"(51-100)",1,"(10-100)",1,"(5-100)",1,"(5-100)","S","(>10)",8,"(81-100)",null,null,"LL1T2A",1,1,1,1,null,"","CN2T3",100,100,44,44,38,38]
[null,82,4,"(56-100)",4,"(81-100)",2,"(56-100)",5,"(71-100)",1,"(>3)",2,"(51-100)",1,"(10-100)",1,"(5-100)",1,"(5-100)","S","(>10)",8,"(81-100)",null,null,"LL1T3A",1,1,1,1,null,"CN3","CN3T0",25,25,43,43,37,37]
[null,83,4,"(56-100)",4,"(81-100)",2,"(56-100)",5,"(71-100)",1,"(>3)",2,"(51-100)",1,"(10-100)",1,"(5-100)",1,"(5-100)","S","(>10)",8,"(81-100)",null,"LLD1","LLD1T1A",4,4,4,4,null,"","CN3T1",50,50,43,43,37,37]
[null,84,4,"(56-100)",4,"(81-100)",2,"(56-100)",5,"(71-100)",1,"(>3)",2,"(51-100)",1,"(10-100)",1,"(5-100)",1,"(5-100)","S","(>10)",8,"(81-100)",null,null,"LLD1T2A",4,4,4,4,null,"","CN3T2",75,75,58,58,50,50]
[null,85,4,"(56-100)",4,"(81-100)",2,"(56-100)",5,"(71-100)",1,"(>3)",2,"(51-100)",1,"(10-100)",1,"(5-100)",1,"(5-100)","S","(>10)",8,"(81-100)",null,null,"LLD1T3A",4,4,4,4,null,"","CN3T3",100,100,67,67,58,58]
[null,86,4,"(56-100)",4,"(81-100)",2,"(56-100)",5,"(71-100)",1,"(>3)",2,"(51-100)",1,"(10-100)",1,"(5-100)",1,"(5-100)","S","(>10)",8,"(81-100)",null,"LK1","LK1T1A",21,21,13,10,null,"CN4","CN4T0",25,25,55,55,47,47]
[null,87,4,"(56-100)",4,"(81-100)",2,"(56-100)",5,"(71-100)",1,"(>3)",2,"(51-100)",1,"(10-100)",1,"(5-100)",1,"(5-100)","S","(>10)",8,"(81-100)",null,null,"LK1T2A",29,29,18,14,null,"","CN4T1",50,50,55,55,47,47]
[null,88,4,"(56-100)",4,"(81-100)",2,"(56-100)",5,"(71-100)",1,"(>3)",2,"(51-100)",1,"(10-100)",1,"(5-100)",1,"(5-100)","S","(>10)",8,"(81-100)",null,null,"LK1T3A",33,33,20,16,null,"","CN4T2",75,75,75,75,65,65]
[null,89,4,"(56-100)",4,"(81-100)",2,"(56-100)",5,"(71-100)",1,"(>3)",2,"(51-100)",1,"(10-100)",1,"(5-100)",1,"(5-100)","S","(>10)",8,"(81-100)",null,"LK2","LK2T1A",45,45,29,23,null,"","CN4T3",100,100,86,86,74,74]
[null,90,4,"(56-100)",4,"(81-100)",2,"(56-100)",5,"(71-100)",1,"(>3)",2,"(51-100)",1,"(10-100)",1,"(5-100)",1,"(5-100)","S","(>10)",8,"(81-100)",null,null,"LK2T2A",59,59,39,31,null,"CN5","CN5T0",25,25,68,68,59,59]
[null,91,4,"(56-100)",4,"(81-100)",2,"(56-100)",5,"(71-100)",1,"(>3)",2,"(51-100)",1,"(10-100)",1,"(5-100)",1,"(5-100)","S","(>10)",8,"(81-100)",null,null,"LK2T3A",70,70,45,36,null,"","CN5T1",50,50,68,68,59,59]
[null,92,4,"(56-100)",4,"(81-100)",2,"(56-100)",5,"(71-100)",1,"(>3)",2,"(51-100)",1,"(10-100)",1,"(5-100)",1,"(5-100)","S","(>10)",8,"(81-100)",null,"LK3","LK3T1A",64,64,44,35,null,"","CN5T2",75,75,91,91,79,79]
[null,93,4,"(56-100)",4,"(81-100)",2,"(56-100)",5,"(71-100)",1,"(>3)",2,"(51-100)",1,"(10-100)",1,"(5-100)",1,"(5-100)","S","(>10)",8,"(81-100)",null,null,"LK3T2A",87,87,56,45,null,"","CN5T3",100,100,104,104,90,90]
[null,94,4,"(56-100)",4,"(81-100)",2,"(56-100)",5,"(71-100)",1,"(>3)",2,"(51-100)",1,"(10-100)",1,"(5-100)",1,"(5-100)","S","(>10)",8,"(81-100)",null,null,"LK3T3A",99,99,64,51,null,"CN6","CN6T0",25,25,71,71,61,61]
[null,95,4,"(56-100)",4,"(81-100)",2,"(56-100)",5,"(71-100)",1,"(>3)",2,"(51-100)",1,"(10-100)",1,"(5-100)",1,"(5-100)","S","(>10)",8,"(81-100)",null,"LK4","LK4T1A",92,92,61,49,null,"","CN6T1",50,50,71,71,61,61]
[null,96,4,"(56-100)",4,"(81-100)",2,"(56-100)",5,"(71-100)",1,"(>3)",2,"(51-100)",1,"(10-100)",1,"(5-100)",1,"(5-100)","S","(>10)",8,"(81-100)",null,null,"LK4T2A",124,124,80,64,null,"","CN6T2",75,75,96,96,83,83]
[null,97,4,"(56-100)",4,"(81-100)",2,"(56-100)",5,"(71-100)",1,"(>3)",2,"(51-100)",1,"(10-100)",1,"(5-100)",1,"(5-100)","S","(>10)",8,"(81-100)",null,null,"LK4T3A",143,143,93,74,null,"","CN6T3",100,100,110,110,95,95]
[null,98,4,"(56-100)",4,"(81-100)",2,"(56-100)",5,"(71-100)",1,"(>3)",2,"(51-100)",1,"(10-100)",1,"(5-100)",1,"(5-100)","S","(>10)",8,"(81-100)",null,"LK5","LK5T1A",122,122,68,54,null,"CN7","CN7T0",25,25,81,81,70,70]
[null,99,4,"(56-100)",4,"(81-100)",2,"(56-100)",5,"(71-100)",1,"(>3)",2,"(51-100)",1,"(10-100)",1,"(5-100)",1,"(5-100)","S","(>10)",8,"(81-100)",null,null,"LK5T2A",164,164,91,73,null,"","CN7T1",50,50,81,81,70,70]
[null,100,4,"(56-100)",4,"(81-100)",2,"(56-100)",5,"(71-100)",1,"(>3)",2,"(51-100)",1,"(10-100)",1,"(5-100)",1,"(5-100)","S","(>10)",8,"(81-100)",null,null,"LK5T3A",187,187,101,81,null,"","CN7T2",75,75,109,109,94,94]
[null,101,5,"(101-200)",5,"(101-200)",3,"(101-200)",6,"(101-200)",1,"(>3)",3,"(101-200)",2,"(101-200)",2,"(101-150)",2,"(101-150)","S","(>10)",9,"(>100)",null,"LK6","LK6T1A",177,177,89,71,null,"","CN7T3",100,100,124,124,107,107]
[null,102,5,"(101-200)",5,"(101-200)",3,"(101-200)",6,"(101-200)",1,"(>3)",3,"(101-200)",2,"(101-200)",2,"(101-150)",2,"(101-150)","S","(>10)",9,"(>100)",null,null,"LK6T2A",237,237,120,96,null,"CN8","CN8T0",25,25,90,90,78,78]
[null,103,5,"(101-200)",5,"(101-200)",3,"(101-200)",6,"(101-200)",1,"(>3)",3,"(101-200)",2,"(101-200)",2,"(101-150)",2,"(101-150)","S","(>10)",9,"(>100)",null,null,"LK6T3A",271,271,136,109,null,"","CN8T1",50,50,90,90,78,78]
[null,104,5,"(101-200)",5,"(101-200)",3,"(101-200)",6,"(101-200)",1,"(>3)",3,"(101-200)",2,"(101-200)",2,"(101-150)",2,"(101-150)","S","(>10)",9,"(>100)",null,"LK7","LK7T1A",252,252,119,95,null,"","CN8T2",75,75,122,122,106,106]
[null,105,5,"(101-200)",5,"(101-200)",3,"(101-200)",6,"(101-200)",1,"(>3)",3,"(101-200)",2,"(101-200)",2,"(101-150)",2,"(101-150)","S","(>10)",9,"(>100)",null,null,"LK7T2A",338,338,160,128,null,"","CN8T3",100,100,138,138,120,120]
[null,106,5,"(101-200)",5,"(101-200)",3,"(101-200)",6,"(101-200)",1,"(>3)",3,"(101-200)",2,"(101-200)",2,"(101-150)",2,"(101-150)","S","(>10)",9,"(>100)",null,null,"LK7T3A",386,386,183,146,null,"CN9","CN9T0",25,25,103,103,89,89]
[null,107,5,"(101-200)",5,"(101-200)",3,"(101-200)",6,"(101-200)",1,"(>3)",3,"(101-200)",2,"(101-200)",2,"(101-150)",2,"(101-150)","S","(>10)",9,"(>100)",null,"LK8","LK8T1A",289,289,126,101,null,"","CN9T1",50,50,103,103,89,89]
[null,108,5,"(101-200)",5,"(101-200)",3,"(101-200)",6,"(101-200)",1,"(>3)",3,"(101-200)",2,"(101-200)",2,"(101-150)",2,"(101-150)","S","(>10)",9,"(>100)",null,null,"LK8T2A",392,392,173,138,null,"","CN9T2",75,75,140,140,121,121]
[null,109,5,"(101-200)",5,"(101-200)",3,"(101-200)",6,"(101-200)",1,"(>3)",3,"(101-200)",2,"(101-200)",2,"(101-150)",2,"(101-150)","S","(>10)",9,"(>100)",null,null,"LK8T3A",446,446,195,156,null,"","CN9T3",100,100,158,158,137,137]
[null,110,5,"(101-200)",5,"(101-200)",3,"(101-200)",6,"(101-200)",1,"(>3)",3,"(101-200)",2,"(101-200)",2,"(101-150)",2,"(101-150)","S","(>10)",9,"(>100)",null,"LK9","LK9T1A",323,323,129,103,null,"CL1","CL1T0",25,25,13,13,11,11]
[null,111,5,"(101-200)",5,"(101-200)",3,"(101-200)",6,"(101-200)",1,"(>3)",3,"(101-200)",2,"(101-200)",2,"(101-150)",2,"(101-150)","S","(>10)",9,"(>100)",null,null,"LK9T2A",437,437,174,139,null,"","CL1T1",50,50,13,13,11,11]
[null,112,5,"(101-200)",5,"(101-200)",3,"(101-200)",6,"(101-200)",1,"(>3)",3,"(101-200)",2,"(101-200)",2,"(101-150)",2,"(101-150)","S","(>10)",9,"(>100)",null,null,"LK9T3A",498,498,199,159,null,"","CL1T2",75,75,18,18,15,15]
[null,113,5,"(101-200)",5,"(101-200)",3,"(101-200)",6,"(101-200)",1,"(>3)",3,"(101-200)",2,"(101-200)",2,"(101-150)",2,"(101-150)","S","(>10)",9,"(>100)",null,"LK10","LK10T1A",351,351,136,109,null,"","CL1T3",100,100,22,22,19,19]
[null,114,5,"(101-200)",5,"(101-200)",3,"(101-200)",6,"(101-200)",1,"(>3)",3,"(101-200)",2,"(101-200)",2,"(101-150)",2,"(101-150)","S","(>10)",9,"(>100)",null,null,"LK10T2A",475,475,183,146,null,"CL2","CL2T0",25,25,36,36,31,31]
[null,115,5,"(101-200)",5,"(101-200)",3,"(101-200)",6,"(101-200)",1,"(>3)",3,"(101-200)",2,"(101-200)",2,"(101-150)",2,"(101-150)","S","(>10)",9,"(>100)",null,null,"LK10T3A",541,541,210,168,null,"","CL2T1",50,50,36,36,31,31]
[null,116,5,"(101-200)",5,"(101-200)",3,"(101-200)",6,"(101-200)",1,"(>3)",3,"(101-200)",2,"(101-200)",2,"(101-150)",2,"(101-150)","S","(>10)",9,"(>100)",null,"LK11","LK11T1A",374,374,140,112,null,"","CL2T2",75,75,48,48,41,41]
[null,117,5,"(101-200)",5,"(101-200)",3,"(101-200)",6,"(101-200)",1,"(>3)",3,"(101-200)",2,"(101-200)",2,"(101-150)",2,"(101-150)","S","(>10)",9,"(>100)",null,null,"LK11T2A",505,505,189,151,null,"","CL2T3",100,100,56,56,48,48]
[null,118,5,"(101-200)",5,"(101-200)",3,"(101-200)",6,"(101-200)",1,"(>3)",3,"(101-200)",2,"(101-200)",2,"(101-150)",2,"(101-150)","S","(>10)",9,"(>100)",null,null,"LK11T3A",575,575,216,173,null,"CL3","CL3T0",25,25,53,53,46,46]
[null,119,5,"(101-200)",5,"(101-200)",3,"(101-200)",6,"(101-200)",1,"(>3)",3,"(101-200)",2,"(101-200)",2,"(101-150)",2,"(101-150)","S","(>10)",9,"(>100)",null,"LK12","LK12T1A",409,409,156,125,null,"","CL3T1",50,50,53,53,46,46]
[null,120,5,"(101-200)",5,"(101-200)",3,"(101-200)",6,"(101-200)",1,"(>3)",3,"(101-200)",2,"(101-200)",2,"(101-150)",2,"(101-150)","S","(>10)",9,"(>100)",null,null,"LK12T2A",553,553,211,169,null,"","CL3T2",75,75,73,73,63,63]
[null,121,5,"(101-200)",5,"(101-200)",3,"(101-200)",6,"(101-200)",1,"(>3)",3,"(101-200)",2,"(101-200)",2,"(101-150)",2,"(101-150)","S","(>10)",9,"(>100)",null,null,"LK12T3A",631,631,241,193,null,"","CL3T3",100,100,84,84,73,73]
[null,122,5,"(101-200)",5,"(101-200)",3,"(101-200)",6,"(101-200)",1,"(>3)",3,"(101-200)",2,"(101-200)",2,"(101-150)",2,"(101-150)","S","(>10)",9,"(>100)",null,"LF1","LF1T1A",21,21,18,14,null,"CL4","CL4T0",25,25,68,68,59,59]
[null,123,5,"(101-200)",5,"(101-200)",3,"(101-200)",6,"(101-200)",1,"(>3)",3,"(101-200)",2,"(101-200)",2,"(101-150)",2,"(101-150)","S","(>10)",9,"(>100)",null,null,"LF1T2A",29,29,25,20,null,"","CL4T1",50,50,68,68,59,59]
[null,124,5,"(101-200)",5,"(101-200)",3,"(101-200)",6,"(101-200)",1,"(>3)",3,"(101-200)",2,"(101-200)",2,"(101-150)",2,"(101-150)","S","(>10)",9,"(>100)",null,null,"LF1T3A",33,33,29,23,null,"","CL4T2",75,75,94,94,81,81]
[null,125,5,"(101-200)",5,"(101-200)",3,"(101-200)",6,"(101-200)",1,"(>3)",3,"(101-200)",2,"(101-200)",2,"(101-150)",2,"(101-150)","S","(>10)",9,"(>100)",null,"LF2","LF2T1A",45,45,39,31,null,"","CL4T3",100,100,107,107,93,93]
[null,126,5,"(101-200)",5,"(101-200)",3,"(101-200)",6,"(101-200)",1,"(>3)",3,"(101-200)",2,"(101-200)",2,"(101-150)",2,"(101-150)","S","(>10)",9,"(>100)",null,null,"LF2T2A",59,59,51,41,null,"CL5","CL5T0",25,25,86,86,74,74]
[null,127,5,"(101-200)",5,"(101-200)",3,"(101-200)",6,"(101-200)",1,"(>3)",3,"(101-200)",2,"(101-200)",2,"(101-150)",2,"(101-150)","S","(>10)",9,"(>100)",null,null,"LF2T3A",70,70,61,49,null,"","CL5T1",50,50,86,86,74,74]
[null,128,5,"(101-200)",5,"(101-200)",3,"(101-200)",6,"(101-200)",1,"(>3)",3,"(101-200)",2,"(101-200)",2,"(101-150)",2,"(101-150)","S","(>10)",9,"(>100)",null,"LF3","LF3T1A",64,64,56,45,null,"","CL5T2",75,75,114,114,99,99]
[null,129,5,"(101-200)",5,"(101-200)",3,"(101-200)",6,"(101-200)",1,"(>3)",3,"(101-200)",2,"(101-200)",2,"(101-150)",2,"(101-150)","S","(>10)",9,"(>100)",null,null,"LF3T2A",87,87,76,61,null,"","CL5T3",100,100,130,130,113,113]
[null,130,5,"(101-200)",5,"(101-200)",3,"(101-200)",6,"(101-200)",1,"(>3)",3,"(101-200)",2,"(101-200)",2,"(101-150)",2,"(101-150)","S","(>10)",9,"(>100)",null,null,"LF3T3A",99,99,86,69,null,"CL6","CL6T0",25,25,88,88,76,76]
[null,131,5,"(101-200)",5,"(101-200)",3,"(101-200)",6,"(101-200)",1,"(>3)",3,"(101-200)",2,"(101-200)",2,"(101-150)",2,"(101-150)","S","(>10)",9,"(>100)",null,"LF4","LF4T1A",92,92,80,64,null,"","CL6T1",50,50,88,88,76,76]
[null,132,5,"(101-200)",5,"(101-200)",3,"(101-200)",6,"(101-200)",1,"(>3)",3,"(101-200)",2,"(101-200)",2,"(101-150)",2,"(101-150)","S","(>10)",9,"(>100)",null,null,"LF4T2A",124,124,108,86,null,"","CL6T2",75,75,120,120,104,104]
[null,133,5,"(101-200)",5,"(101-200)",3,"(101-200)",6,"(101-200)",1,"(>3)",3,"(101-200)",2,"(101-200)",2,"(101-150)",2,"(101-150)","S","(>10)",9,"(>100)",null,null,"LF4T3A",143,143,124,99,null,"","CL6T3",100,100,137,137,119,119]
[null,134,5,"(101-200)",5,"(101-200)",3,"(101-200)",6,"(101-200)",1,"(>3)",3,"(101-200)",2,"(101-200)",2,"(101-150)",2,"(101-150)","S","(>10)",9,"(>100)",null,"LF5","LF5T1A",122,122,106,85,null,"CL7","CL7T0",25,25,102,102,88,88]
[null,135,5,"(101-200)",5,"(101-200)",3,"(101-200)",6,"(101-200)",1,"(>3)",3,"(101-200)",2,"(101-200)",2,"(101-150)",2,"(101-150)","S","(>10)",9,"(>100)",null,null,"LF5T2A",164,164,143,114,null,"","CL7T1",50,50,102,102,88,88]
[null,136,5,"(101-200)",5,"(101-200)",3,"(101-200)",6,"(101-200)",1,"(>3)",3,"(101-200)",2,"(101-200)",2,"(101-150)",2,"(101-150)","S","(>10)",9,"(>100)",null,null,"LF5T3A",187,187,163,130,null,"","CL7T2",75,75,136,136,118,118]
[null,137,5,"(101-200)",5,"(101-200)",3,"(101-200)",6,"(101-200)",1,"(>3)",3,"(101-200)",2,"(101-200)",2,"(101-150)",2,"(101-150)","S","(>10)",9,"(>100)",null,"LF6","LF6T1A",177,177,154,123,null,"","CL7T3",100,100,155,155,134,134]
[null,138,5,"(101-200)",5,"(101-200)",3,"(101-200)",6,"(101-200)",1,"(>3)",3,"(101-200)",2,"(101-200)",2,"(101-150)",2,"(101-150)","S","(>10)",9,"(>100)",null,null,"LF6T2A",237,237,206,165,null,"CL8","CL8T0",25,25,113,113,98,98]
[null,139,5,"(101-200)",5,"(101-200)",3,"(101-200)",6,"(101-200)",1,"(>3)",3,"(101-200)",2,"(101-200)",2,"(101-150)",2,"(101-150)","S","(>10)",9,"(>100)",null,null,"LF6T3A",271,271,236,189,null,"","CL8T1",50,50,113,113,98,98]
[null,140,5,"(101-200)",5,"(101-200)",3,"(101-200)",6,"(101-200)",1,"(>3)",3,"(101-200)",2,"(101-200)",2,"(101-150)",2,"(101-150)","S","(>10)",9,"(>100)",null,"LF7","LF7T1A",252,252,219,175,null,"","CL8T2",75,75,153,153,133,133]
[null,141,5,"(101-200)",5,"(101-200)",3,"(101-200)",6,"(101-200)",1,"(>3)",3,"(101-200)",2,"(101-200)",2,"(101-150)",2,"(101-150)","S","(>10)",9,"(>100)",null,null,"LF7T2A",338,338,294,235,null,"","CL8T3",100,100,173,173,150,150]
[null,142,5,"(101-200)",5,"(101-200)",3,"(101-200)",6,"(101-200)",1,"(>3)",3,"(101-200)",2,"(101-200)",2,"(101-150)",2,"(101-150)","S","(>10)",9,"(>100)",null,null,"LF7T3A",386,386,336,269,null,"CL9","CL9T0",25,25,128,128,111,111]
[null,143,5,"(101-200)",5,"(101-200)",3,"(101-200)",6,"(101-200)",1,"(>3)",3,"(101-200)",2,"(101-200)",2,"(101-150)",2,"(101-150)","S","(>10)",9,"(>100)",null,"LF8","LF8T1A",289,289,251,201,null,"","CL9T1",50,50,128,128,111,111]
[null,144,5,"(101-200)",5,"(101-200)",3,"(101-200)",6,"(101-200)",1,"(>3)",3,"(101-200)",2,"(101-200)",2,"(101-150)",2,"(101-150)","S","(>10)",9,"(>100)",null,null,"LF8T2A",392,392,341,273,null,"","CL9T2",75,75,174,174,151,151]
[null,145,5,"(101-200)",5,"(101-200)",3,"(101-200)",6,"(101-200)",1,"(>3)",3,"(101-200)",2,"(101-200)",2,"(101-150)",2,"(101-150)","S","(>10)",9,"(>100)",null,null,"LF8T3A",446,446,388,310,null,"","CL9T3",100,100,197,197,171,171]
[null,146,5,"(101-200)",5,"(101-200)",3,"(101-200)",6,"(101-200)",1,"(>3)",3,"(101-200)",2,"(101-200)",2,"(101-150)",2,"(101-150)","S","(>10)",9,"(>100)",null,"LF9","LF9T1A",323,323,281,225]
[null,147,5,"(101-200)",5,"(101-200)",3,"(101-200)",6,"(101-200)",1,"(>3)",3,"(101-200)",2,"(101-200)",2,"(101-150)",2,"(101-150)","S","(>10)",9,"(>100)",null,null,"LF9T2A",437,437,380,304]
[null,148,5,"(101-200)",5,"(101-200)",3,"(101-200)",6,"(101-200)",1,"(>3)",3,"(101-200)",2,"(101-200)",2,"(101-150)",2,"(101-150)","S","(>10)",9,"(>100)",null,null,"LF9T3A",498,498,433,346]
[null,149,5,"(101-200)",5,"(101-200)",3,"(101-200)",6,"(101-200)",1,"(>3)",3,"(101-200)",2,"(101-200)",2,"(101-150)",2,"(101-150)","S","(>10)",9,"(>100)",null,"LF10","LF10T1A",351,351,305,244]
[null,150,5,"(101-200)",5,"(101-200)",3,"(101-200)",6,"(101-200)",1,"(>3)",3,"(101-200)",2,"(101-200)",2,"(101-150)",2,"(101-150)","S","(>10)",9,"(>100)",null,null,"LF10T2A",475,475,413,330]
[null,151,5,"(101-200)",5,"(101-200)",3,"(101-200)",6,"(101-200)",1,"(>3)",3,"(101-200)",2,"(101-200)",3,"(151-200)",3,"(151-200)","S","(>10)",9,"(>100)",null,null,"LF10T3A",541,541,470,376]
[null,152,5,"(101-200)",5,"(101-200)",3,"(101-200)",6,"(101-200)",1,"(>3)",3,"(101-200)",2,"(101-200)",3,"(151-200)",3,"(151-200)","S","(>10)",9,"(>100)",null,"LF11","LF11T1A",374,374,325,260]
[null,153,5,"(101-200)",5,"(101-200)",3,"(101-200)",6,"(101-200)",1,"(>3)",3,"(101-200)",2,"(101-200)",3,"(151-200)",3,"(151-200)","S","(>10)",9,"(>100)",null,null,"LF11T2A",505,505,439,351]
[null,154,5,"(101-200)",5,"(101-200)",3,"(101-200)",6,"(101-200)",1,"(>3)",3,"(101-200)",2,"(101-200)",3,"(151-200)",3,"(151-200)","S","(>10)",9,"(>100)",null,null,"LF11T3A",575,575,500,400]
[null,155,5,"(101-200)",5,"(101-200)",3,"(101-200)",6,"(101-200)",1,"(>3)",3,"(101-200)",2,"(101-200)",3,"(151-200)",3,"(151-200)","S","(>10)",9,"(>100)",null,"LF12","LF12T1A",409,409,356,285]
[null,156,5,"(101-200)",5,"(101-200)",3,"(101-200)",6,"(101-200)",1,"(>3)",3,"(101-200)",2,"(101-200)",3,"(151-200)",3,"(151-200)","S","(>10)",9,"(>100)",null,null,"LF12T2A",553,553,481,385]
[null,157,5,"(101-200)",5,"(101-200)",3,"(101-200)",6,"(101-200)",1,"(>3)",3,"(101-200)",2,"(101-200)",3,"(151-200)",3,"(151-200)","S","(>10)",9,"(>100)",null,null,"LF12T3A",631,631,549,439]
[null,158,5,"(101-200)",5,"(101-200)",3,"(101-200)",6,"(101-200)",1,"(>3)",3,"(101-200)",2,"(101-200)",3,"(151-200)",3,"(151-200)","S","(>10)",9,"(>100)",null,"4'T12-LLD1","4'T12-LLD1T1A",4,4,4,4]
[null,159,5,"(101-200)",5,"(101-200)",3,"(101-200)",6,"(101-200)",1,"(>3)",3,"(101-200)",2,"(101-200)",3,"(151-200)",3,"(151-200)","S","(>10)",9,"(>100)",null,null,"4'T12-LLD1T2A",4,4,4,4]
[null,160,5,"(101-200)",5,"(101-200)",3,"(101-200)",6,"(101-200)",1,"(>3)",3,"(101-200)",2,"(101-200)",3,"(151-200)",3,"(151-200)","S","(>10)",9,"(>100)",null,null,"4'T12-LLD1T3A",4,4,4,4]
[null,161,5,"(101-200)",5,"(101-200)",3,"(101-200)",6,"(101-200)",1,"(>3)",3,"(101-200)",2,"(101-200)",3,"(151-200)",3,"(151-200)","S","(>10)",9,"(>100)",null,"4'T12-LLD2","4'T12-LLD2T1A",4,4,4,4]
[null,162,5,"(101-200)",5,"(101-200)",3,"(101-200)",6,"(101-200)",1,"(>3)",3,"(101-200)",2,"(101-200)",3,"(151-200)",3,"(151-200)","S","(>10)",9,"(>100)",null,null,"4'T12-LLD2T2A",4,4,4,4]
[null,163,5,"(101-200)",5,"(101-200)",3,"(101-200)",6,"(101-200)",1,"(>3)",3,"(101-200)",2,"(101-200)",3,"(151-200)",3,"(151-200)","S","(>10)",9,"(>100)",null,null,"4'T12-LLD2T3A",4,4,4,4]
[null,164,5,"(101-200)",5,"(101-200)",3,"(101-200)",6,"(101-200)",1,"(>3)",3,"(101-200)",2,"(101-200)",3,"(151-200)",3,"(151-200)","S","(>10)",9,"(>100)",null,"4'T12-LLD3","4'T12-LLD3T1A",4,4,4,4]
[null,165,5,"(101-200)",5,"(101-200)",3,"(101-200)",6,"(101-200)",1,"(>3)",3,"(101-200)",2,"(101-200)",3,"(151-200)",3,"(151-200)","S","(>10)",9,"(>100)",null,null,"4'T12-LLD3T2A",4,4,4,4]
[null,166,5,"(101-200)",5,"(101-200)",3,"(101-200)",6,"(101-200)",1,"(>3)",3,"(101-200)",2,"(101-200)",3,"(151-200)",3,"(151-200)","S","(>10)",9,"(>100)",null,null,"4'T12-LLD3T3A",4,4,4,4]
[null,167,5,"(101-200)",5,"(101-200)",3,"(101-200)",6,"(101-200)",1,"(>3)",3,"(101-200)",2,"(101-200)",3,"(151-200)",3,"(151-200)","S","(>10)",9,"(>100)",null,"4'T12-LLD4","4'T12-LLD4T1A",4,4,4,4]
[null,168,5,"(101-200)",5,"(101-200)",3,"(101-200)",6,"(101-200)",1,"(>3)",3,"(101-200)",2,"(101-200)",3,"(151-200)",3,"(151-200)","S","(>10)",9,"(>100)",null,null,"4'T12-LLD4T2A",4,4,4,4]
[null,169,5,"(101-200)",5,"(101-200)",3,"(101-200)",6,"(101-200)",1,"(>3)",3,"(101-200)",2,"(101-200)",3,"(151-200)",3,"(151-200)","S","(>10)",9,"(>100)",null,null,"4'T12-LLD4T3A",4,4,4,4]
[null,170,5,"(101-200)",5,"(101-200)",3,"(101-200)",6,"(101-200)",1,"(>3)",3,"(101-200)",2,"(101-200)",3,"(151-200)",3,"(151-200)","S","(>10)",9,"(>100)",null,"4'T12-LLD5","4'T12-LLD5T1A",4,4,4,4]
[null,171,5,"(101-200)",5,"(101-200)",3,"(101-200)",6,"(101-200)",1,"(>3)",3,"(101-200)",2,"(101-200)",3,"(151-200)",3,"(151-200)","S","(>10)",9,"(>100)",null,null,"4'T12-LLD5T2A",4,4,4,4]
[null,172,5,"(101-200)",5,"(101-200)",3,"(101-200)",6,"(101-200)",1,"(>3)",3,"(101-200)",2,"(101-200)",3,"(151-200)",3,"(151-200)","S","(>10)",9,"(>100)",null,null,"4'T12-LLD5T3A",4,4,4,4]
[null,173,5,"(101-200)",5,"(101-200)",3,"(101-200)",6,"(101-200)",1,"(>3)",3,"(101-200)",2,"(101-200)",3,"(151-200)",3,"(151-200)","S","(>10)",9,"(>100)",null,"4'T12-LLD6","4'T12-LLD6T1A",4,4,4,4]
[null,174,5,"(101-200)",5,"(101-200)",3,"(101-200)",6,"(101-200)",1,"(>3)",3,"(101-200)",2,"(101-200)",3,"(151-200)",3,"(151-200)","S","(>10)",9,"(>100)",null,null,"4'T12-LLD6T2A",4,4,4,4]
[null,175,5,"(101-200)",5,"(101-200)",3,"(101-200)",6,"(101-200)",1,"(>3)",3,"(101-200)",2,"(101-200)",3,"(151-200)",3,"(151-200)","S","(>10)",9,"(>100)",null,null,"4'T12-LLD6T3A",4,4,4,4]
[null,176,5,"(101-200)",5,"(101-200)",3,"(101-200)",6,"(101-200)",1,"(>3)",3,"(101-200)",2,"(101-200)",3,"(151-200)",3,"(151-200)","S","(>10)",9,"(>100)",null,"4'T12-LLD7","4'T12-LLD7T1A",4,4,4,4]
[null,177,5,"(101-200)",5,"(101-200)",3,"(101-200)",6,"(101-200)",1,"(>3)",3,"(101-200)",2,"(101-200)",3,"(151-200)",3,"(151-200)","S","(>10)",9,"(>100)",null,null,"4'T12-LLD7T2A",4,4,4,4]
[null,178,5,"(101-200)",5,"(101-200)",3,"(101-200)",6,"(101-200)",1,"(>3)",3,"(101-200)",2,"(101-200)",3,"(151-200)",3,"(151-200)","S","(>10)",9,"(>100)",null,null,"4'T12-LLD7T3A",4,4,4,4]
[null,179,5,"(101-200)",5,"(101-200)",3,"(101-200)",6,"(101-200)",1,"(>3)",3,"(101-200)",2,"(101-200)",3,"(151-200)",3,"(151-200)","S","(>10)",9,"(>100)",null,"4'T12-LLD8","4'T12-LLD8T1A",4,4,4,4]
[null,180,5,"(101-200)",5,"(101-200)",3,"(101-200)",6,"(101-200)",1,"(>3)",3,"(101-200)",2,"(101-200)",3,"(151-200)",3,"(151-200)","S","(>10)",9,"(>100)",null,null,"4'T12-LLD8T2A",4,4,4,4]
[null,181,5,"(101-200)",5,"(101-200)",3,"(101-200)",6,"(101-200)",1,"(>3)",3,"(101-200)",2,"(101-200)",3,"(151-200)",3,"(151-200)","S","(>10)",9,"(>100)",null,null,"4'T12-LLD8T3A",4,4,4,4]
[null,182,5,"(101-200)",5,"(101-200)",3,"(101-200)",6,"(101-200)",1,"(>3)",3,"(101-200)",2,"(101-200)",3,"(151-200)",3,"(151-200)","S","(>10)",9,"(>100)",null,"4'T12-LLD9","4'T12-LLD9T1A",4,4,4,4]
[null,183,5,"(101-200)",5,"(101-200)",3,"(101-200)",6,"(101-200)",1,"(>3)",3,"(101-200)",2,"(101-200)",3,"(151-200)",3,"(151-200)","S","(>10)",9,"(>100)",null,null,"4'T12-LLD9T2A",4,4,4,4]
[null,184,5,"(101-200)",5,"(101-200)",3,"(101-200)",6,"(101-200)",1,"(>3)",3,"(101-200)",2,"(101-200)",3,"(151-200)",3,"(151-200)","S","(>10)",9,"(>100)",null,null,"4'T12-LLD9T3A",4,4,4,4]
[null,185,5,"(101-200)",5,"(101-200)",3,"(101-200)",6,"(101-200)",1,"(>3)",3,"(101-200)",2,"(101-200)",3,"(151-200)",3,"(151-200)","S","(>10)",9,"(>100)",null,"4'T12-LLD10","4'T12-LLD10T1A",4,4,4,4]
[null,186,5,"(101-200)",5,"(101-200)",3,"(101-200)",6,"(101-200)",1,"(>3)",3,"(101-200)",2,"(101-200)",3,"(151-200)",3,"(151-200)","S","(>10)",9,"(>100)",null,null,"4'T12-LLD10T2A",4,4,4,4]
[null,187,5,"(101-200)",5,"(101-200)",3,"(101-200)",6,"(101-200)",1,"(>3)",3,"(101-200)",2,"(101-200)",3,"(151-200)",3,"(151-200)","S","(>10)",9,"(>100)",null,null,"4'T12-LLD10T3A",4,4,4,4]
[null,188,5,"(101-200)",5,"(101-200)",3,"(101-200)",6,"(101-200)",1,"(>3)",3,"(101-200)",2,"(101-200)",3,"(151-200)",3,"(151-200)","S","(>10)",9,"(>100)",null,"4'T12-LLD11","4'T12-LLD11T1A",4,4,4,4]
[null,189,5,"(101-200)",5,"(101-200)",3,"(101-200)",6,"(101-200)",1,"(>3)",3,"(101-200)",2,"(101-200)",3,"(151-200)",3,"(151-200)","S","(>10)",9,"(>100)",null,null,"4'T12-LLD11T2A",4,4,4,4]
[null,190,5,"(101-200)",5,"(101-200)",3,"(101-200)",6,"(101-200)",1,"(>3)",3,"(101-200)",2,"(101-200)",3,"(151-200)",3,"(151-200)","S","(>10)",9,"(>100)",null,null,"4'T12-LLD11T3A",4,4,4,4]
[null,191,5,"(101-200)",5,"(101-200)",3,"(101-200)",6,"(101-200)",1,"(>3)",3,"(101-200)",2,"(101-200)",3,"(151-200)",3,"(151-200)","S","(>10)",9,"(>100)",null,"4'T12-LK1","4'T12-LK1T1A",47,47,29,23]
[null,192,5,"(101-200)",5,"(101-200)",3,"(101-200)",6,"(101-200)",1,"(>3)",3,"(101-200)",2,"(101-200)",3,"(151-200)",3,"(151-200)","S","(>10)",9,"(>100)",null,null,"4'T12-LK1T2A",63,63,38,30]
[null,193,5,"(101-200)",5,"(101-200)",3,"(101-200)",6,"(101-200)",1,"(>3)",3,"(101-200)",2,"(101-200)",3,"(151-200)",3,"(151-200)","S","(>10)",9,"(>100)",null,null,"4'T12-LK1T3A",74,74,44,35]
[null,194,5,"(101-200)",5,"(101-200)",3,"(101-200)",6,"(101-200)",1,"(>3)",3,"(101-200)",2,"(101-200)",3,"(151-200)",3,"(151-200)","S","(>10)",9,"(>100)",null,"4'T12-LK2","4'T12-LK2T1A",63,63,38,30]
[null,195,5,"(101-200)",5,"(101-200)",3,"(101-200)",6,"(101-200)",1,"(>3)",3,"(101-200)",2,"(101-200)",3,"(151-200)",3,"(151-200)","S","(>10)",9,"(>100)",null,null,"4'T12-LK2T2A",85,85,50,40]
[null,196,5,"(101-200)",5,"(101-200)",3,"(101-200)",6,"(101-200)",1,"(>3)",3,"(101-200)",2,"(101-200)",3,"(151-200)",3,"(151-200)","S","(>10)",9,"(>100)",null,null,"4'T12-LK2T3A",95,95,56,45]
[null,197,5,"(101-200)",5,"(101-200)",3,"(101-200)",6,"(101-200)",1,"(>3)",3,"(101-200)",2,"(101-200)",3,"(151-200)",3,"(151-200)","S","(>10)",9,"(>100)",null,"4'T12-LK3","4'T12-LK3T1A",79,79,49,39]
[null,198,5,"(101-200)",5,"(101-200)",3,"(101-200)",6,"(101-200)",1,"(>3)",3,"(101-200)",2,"(101-200)",3,"(151-200)",3,"(151-200)","S","(>10)",9,"(>100)",null,null,"4'T12-LK3T2A",107,107,64,51]
[null,199,5,"(101-200)",5,"(101-200)",3,"(101-200)",6,"(101-200)",1,"(>3)",3,"(101-200)",2,"(101-200)",3,"(151-200)",3,"(151-200)","S","(>10)",9,"(>100)",null,null,"4'T12-LK3T3A",122,122,74,59]
[null,200,5,"(101-200)",5,"(101-200)",3,"(101-200)",6,"(101-200)",1,"(>3)",3,"(101-200)",2,"(101-200)",3,"(151-200)",3,"(151-200)","S","(>10)",9,"(>100)",null,"4'T12-LK4","4'T12-LK4T1A",99,99,60,48]
[null,201,6,"(201-250)",6,"(201-250)",4,"(201-250)",{"$f":"C206+1","v":7},{"$f":"D206","v":"(201-250)"},1,"(>3)",4,"(201-250)",3,"(>200)",4,"(201-250)",4,"(201-250)","S","(>10)",9,"(>100)",null,null,"4'T12-LK4T2A",133,133,79,63]
[null,202,6,"(201-250)",6,"(201-250)",4,"(201-250)",{"$f":"C207+1","v":7},{"$f":"D207","v":"(201-250)"},1,"(>3)",4,"(201-250)",3,"(>200)",4,"(201-250)",4,"(201-250)","S","(>10)",9,"(>100)",null,null,"4'T12-LK4T3A",153,153,91,73]
[null,203,6,"(201-250)",6,"(201-250)",4,"(201-250)",7,"(201-250)",1,"(>3)",4,"(201-250)",3,"(>200)",4,"(201-250)",4,"(201-250)","S","(>10)",9,"(>100)",null,"4'T12-LK5","4'T12-LK5T1A",177,177,89,56]
[null,204,6,"(201-250)",6,"(201-250)",4,"(201-250)",7,"(201-250)",1,"(>3)",4,"(201-250)",3,"(>200)",4,"(201-250)",4,"(201-250)","S","(>10)",9,"(>100)",null,null,"4'T12-LK5T2A",237,237,120,75]
[null,205,6,"(201-250)",6,"(201-250)",4,"(201-250)",7,"(201-250)",1,"(>3)",4,"(201-250)",3,"(>200)",4,"(201-250)",4,"(201-250)","S","(>10)",9,"(>100)",null,null,"4'T12-LK5T3A",271,271,136,86]
[null,206,6,"(201-250)",6,"(201-250)",4,"(201-250)",7,"(201-250)",1,"(>3)",4,"(201-250)",3,"(>200)",4,"(201-250)",4,"(201-250)","S","(>10)",9,"(>100)",null,"4'T12-LK6","4'T12-LK6T1A",252,252,119,56]
[null,207,6,"(201-250)",6,"(201-250)",4,"(201-250)",7,"(201-250)",1,"(>3)",4,"(201-250)",3,"(>200)",4,"(201-250)",4,"(201-250)","S","(>10)",9,"(>100)",null,null,"4'T12-LK6T2A",338,338,160,75]
[null,208,6,"(201-250)",6,"(201-250)",4,"(201-250)",7,"(201-250)",1,"(>3)",4,"(201-250)",3,"(>200)",4,"(201-250)",4,"(201-250)","S","(>10)",9,"(>100)",null,null,"4'T12-LK6T3A",386,386,183,86]
[null,209,6,"(201-250)",6,"(201-250)",4,"(201-250)",7,"(201-250)",1,"(>3)",4,"(201-250)",3,"(>200)",4,"(201-250)",4,"(201-250)","S","(>10)",9,"(>100)",null,"4'T12-LK7","4'T12-LK7T1A",289,289,126,56]
[null,210,6,"(201-250)",6,"(201-250)",4,"(201-250)",7,"(201-250)",1,"(>3)",4,"(201-250)",3,"(>200)",4,"(201-250)",4,"(201-250)","S","(>10)",9,"(>100)",null,null,"4'T12-LK7T2A",392,392,173,75]
[null,211,6,"(201-250)",6,"(201-250)",4,"(201-250)",7,"(201-250)",1,"(>3)",4,"(201-250)",3,"(>200)",4,"(201-250)",4,"(201-250)","S","(>10)",9,"(>100)",null,null,"4'T12-LK7T3A",446,446,195,86]
[null,212,6,"(201-250)",6,"(201-250)",4,"(201-250)",7,"(201-250)",1,"(>3)",4,"(201-250)",3,"(>200)",4,"(201-250)",4,"(201-250)","S","(>10)",9,"(>100)",null,"4'T12-LK8","4'T12-LK8T1A",323,323,129,56]
[null,213,6,"(201-250)",6,"(201-250)",4,"(201-250)",7,"(201-250)",1,"(>3)",4,"(201-250)",3,"(>200)",4,"(201-250)",4,"(201-250)","S","(>10)",9,"(>100)",null,null,"4'T12-LK8T2A",437,437,174,75]
[null,214,6,"(201-250)",6,"(201-250)",4,"(201-250)",7,"(201-250)",1,"(>3)",4,"(201-250)",3,"(>200)",4,"(201-250)",4,"(201-250)","S","(>10)",9,"(>100)",null,null,"4'T12-LK8T3A",498,498,199,86]
[null,215,6,"(201-250)",6,"(201-250)",4,"(201-250)",7,"(201-250)",1,"(>3)",4,"(201-250)",3,"(>200)",4,"(201-250)",4,"(201-250)","S","(>10)",9,"(>100)",null,"4'T12-LK9","4'T12-LK9T1A",351,351,136,56]
[null,216,6,"(201-250)",6,"(201-250)",4,"(201-250)",7,"(201-250)",1,"(>3)",4,"(201-250)",3,"(>200)",4,"(201-250)",4,"(201-250)","S","(>10)",9,"(>100)",null,null,"4'T12-LK9T2A",475,475,183,75]
[null,217,6,"(201-250)",6,"(201-250)",4,"(201-250)",7,"(201-250)",1,"(>3)",4,"(201-250)",3,"(>200)",4,"(201-250)",4,"(201-250)","S","(>10)",9,"(>100)",null,null,"4'T12-LK9T3A",541,541,210,86]
[null,218,6,"(201-250)",6,"(201-250)",4,"(201-250)",7,"(201-250)",1,"(>3)",4,"(201-250)",3,"(>200)",4,"(201-250)",4,"(201-250)","S","(>10)",9,"(>100)",null,"4'T12-LK10","4'T12-LK10T1A",374,374,140,56]
[null,219,6,"(201-250)",6,"(201-250)",4,"(201-250)",7,"(201-250)",1,"(>3)",4,"(201-250)",3,"(>200)",4,"(201-250)",4,"(201-250)","S","(>10)",9,"(>100)",null,null,"4'T12-LK10T2A",505,505,189,75]
[null,220,6,"(201-250)",6,"(201-250)",4,"(201-250)",7,"(201-250)",1,"(>3)",4,"(201-250)",3,"(>200)",4,"(201-250)",4,"(201-250)","S","(>10)",9,"(>100)",null,null,"4'T12-LK10T3A",575,575,216,86]
[null,221,6,"(201-250)",6,"(201-250)",4,"(201-250)",7,"(201-250)",1,"(>3)",4,"(201-250)",3,"(>200)",4,"(201-250)",4,"(201-250)","S","(>10)",9,"(>100)",null,"4'T12-LK11","4'T12-LK11T1A",409,409,156,56]
[null,222,6,"(201-250)",6,"(201-250)",4,"(201-250)",7,"(201-250)",1,"(>3)",4,"(201-250)",3,"(>200)",4,"(201-250)",4,"(201-250)","S","(>10)",9,"(>100)",null,null,"4'T12-LK11T2A",553,553,211,75]
[null,223,6,"(201-250)",6,"(201-250)",4,"(201-250)",7,"(201-250)",1,"(>3)",4,"(201-250)",3,"(>200)",4,"(201-250)",4,"(201-250)","S","(>10)",9,"(>100)",null,null,"4'T12-LK11T3A",631,631,241,86]
[null,224,6,"(201-250)",6,"(201-250)",4,"(201-250)",7,"(201-250)",1,"(>3)",4,"(201-250)",3,"(>200)",4,"(201-250)",4,"(201-250)","S","(>10)",9,"(>100)",null,"4'T12-LF1","4'T12-LF1T1A",47,47,41,33]
[null,225,6,"(201-250)",6,"(201-250)",4,"(201-250)",7,"(201-250)",1,"(>3)",4,"(201-250)",3,"(>200)",4,"(201-250)",4,"(201-250)","S","(>10)",9,"(>100)",null,null,"4'T12-LF1T2A",63,63,55,44]
[null,226,6,"(201-250)",6,"(201-250)",4,"(201-250)",7,"(201-250)",1,"(>3)",4,"(201-250)",3,"(>200)",4,"(201-250)",4,"(201-250)","S","(>10)",9,"(>100)",null,null,"4'T12-LF1T3A",74,74,64,51]
[null,227,6,"(201-250)",6,"(201-250)",4,"(201-250)",7,"(201-250)",1,"(>3)",4,"(201-250)",3,"(>200)",4,"(201-250)",4,"(201-250)","S","(>10)",9,"(>100)",null,"4'T12-LF2","4'T12-LF2T1A",63,63,55,44]
[null,228,6,"(201-250)",6,"(201-250)",4,"(201-250)",7,"(201-250)",1,"(>3)",4,"(201-250)",3,"(>200)",4,"(201-250)",4,"(201-250)","S","(>10)",9,"(>100)",null,null,"4'T12-LF2T2A",85,85,74,59]
[null,229,6,"(201-250)",6,"(201-250)",4,"(201-250)",7,"(201-250)",1,"(>3)",4,"(201-250)",3,"(>200)",4,"(201-250)",4,"(201-250)","S","(>10)",9,"(>100)",null,null,"4'T12-LF2T3A",95,95,83,66]
[null,230,6,"(201-250)",6,"(201-250)",4,"(201-250)",7,"(201-250)",1,"(>3)",4,"(201-250)",3,"(>200)",4,"(201-250)",4,"(201-250)","S","(>10)",9,"(>100)",null,"4'T12-LF3","4'T12-LF3T1A",79,79,69,55]
[null,231,6,"(201-250)",6,"(201-250)",4,"(201-250)",7,"(201-250)",1,"(>3)",4,"(201-250)",3,"(>200)",4,"(201-250)",4,"(201-250)","S","(>10)",9,"(>100)",null,null,"4'T12-LF3T2A",107,107,93,74]
[null,232,6,"(201-250)",6,"(201-250)",4,"(201-250)",7,"(201-250)",1,"(>3)",4,"(201-250)",3,"(>200)",4,"(201-250)",4,"(201-250)","S","(>10)",9,"(>100)",null,null,"4'T12-LF3T3A",122,122,106,85]
[null,233,6,"(201-250)",6,"(201-250)",4,"(201-250)",7,"(201-250)",1,"(>3)",4,"(201-250)",3,"(>200)",4,"(201-250)",4,"(201-250)","S","(>10)",9,"(>100)",null,"4'T12-LF4","4'T12-LF4T1A",99,99,86,69]
[null,234,6,"(201-250)",6,"(201-250)",4,"(201-250)",7,"(201-250)",1,"(>3)",4,"(201-250)",3,"(>200)",4,"(201-250)",4,"(201-250)","S","(>10)",9,"(>100)",null,null,"4'T12-LF4T2A",133,133,116,93]
[null,235,6,"(201-250)",6,"(201-250)",4,"(201-250)",7,"(201-250)",1,"(>3)",4,"(201-250)",3,"(>200)",4,"(201-250)",4,"(201-250)","S","(>10)",9,"(>100)",null,null,"4'T12-LF4T3A",153,153,133,106]
[null,236,6,"(201-250)",6,"(201-250)",4,"(201-250)",7,"(201-250)",1,"(>3)",4,"(201-250)",3,"(>200)",4,"(201-250)",4,"(201-250)","S","(>10)",9,"(>100)",null,"4'T12-LF5","4'T12-LF5T1A",177,177,154,83]
[null,237,6,"(201-250)",6,"(201-250)",4,"(201-250)",7,"(201-250)",1,"(>3)",4,"(201-250)",3,"(>200)",4,"(201-250)",4,"(201-250)","S","(>10)",9,"(>100)",null,null,"4'T12-LF5T2A",237,237,206,111]
[null,238,6,"(201-250)",6,"(201-250)",4,"(201-250)",7,"(201-250)",1,"(>3)",4,"(201-250)",3,"(>200)",4,"(201-250)",4,"(201-250)","S","(>10)",9,"(>100)",null,null,"4'T12-LF5T3A",271,271,236,128]
[null,239,6,"(201-250)",6,"(201-250)",4,"(201-250)",7,"(201-250)",1,"(>3)",4,"(201-250)",3,"(>200)",4,"(201-250)",4,"(201-250)","S","(>10)",9,"(>100)",null,"4'T12-LF6","4'T12-LF6T1A",252,252,219,83]
[null,240,6,"(201-250)",6,"(201-250)",4,"(201-250)",7,"(201-250)",1,"(>3)",4,"(201-250)",3,"(>200)",4,"(201-250)",4,"(201-250)","S","(>10)",9,"(>100)",null,null,"4'T12-LF6T2A",338,338,294,111]
[null,241,6,"(201-250)",6,"(201-250)",4,"(201-250)",7,"(201-250)",1,"(>3)",4,"(201-250)",3,"(>200)",4,"(201-250)",4,"(201-250)","S","(>10)",9,"(>100)",null,null,"4'T12-LF6T3A",386,386,336,128]
[null,242,6,"(201-250)",6,"(201-250)",4,"(201-250)",7,"(201-250)",1,"(>3)",4,"(201-250)",3,"(>200)",4,"(201-250)",4,"(201-250)","S","(>10)",9,"(>100)",null,"4'T12-LF7","4'T12-LF7T1A",289,289,251,83]
[null,243,6,"(201-250)",6,"(201-250)",4,"(201-250)",7,"(201-250)",1,"(>3)",4,"(201-250)",3,"(>200)",4,"(201-250)",4,"(201-250)","S","(>10)",9,"(>100)",null,null,"4'T12-LF7T2A",392,392,341,111]
[null,244,6,"(201-250)",6,"(201-250)",4,"(201-250)",7,"(201-250)",1,"(>3)",4,"(201-250)",3,"(>200)",4,"(201-250)",4,"(201-250)","S","(>10)",9,"(>100)",null,null,"4'T12-LF7T3A",446,446,388,128]
[null,245,6,"(201-250)",6,"(201-250)",4,"(201-250)",7,"(201-250)",1,"(>3)",4,"(201-250)",3,"(>200)",4,"(201-250)",4,"(201-250)","S","(>10)",9,"(>100)",null,"4'T12-LF8","4'T12-LF8T1A",323,323,281,83]
[null,246,6,"(201-250)",6,"(201-250)",4,"(201-250)",7,"(201-250)",1,"(>3)",4,"(201-250)",3,"(>200)",4,"(201-250)",4,"(201-250)","S","(>10)",9,"(>100)",null,null,"4'T12-LF8T2A",437,437,380,111]
[null,247,6,"(201-250)",6,"(201-250)",4,"(201-250)",7,"(201-250)",1,"(>3)",4,"(201-250)",3,"(>200)",4,"(201-250)",4,"(201-250)","S","(>10)",9,"(>100)",null,null,"4'T12-LF8T3A",498,498,433,128]
[null,248,6,"(201-250)",6,"(201-250)",4,"(201-250)",7,"(201-250)",1,"(>3)",4,"(201-250)",3,"(>200)",4,"(201-250)",4,"(201-250)","S","(>10)",9,"(>100)",null,"4'T12-LF9","4'T12-LF9T1A",351,351,305,83]
[null,249,6,"(201-250)",6,"(201-250)",4,"(201-250)",7,"(201-250)",1,"(>3)",4,"(201-250)",3,"(>200)",4,"(201-250)",4,"(201-250)","S","(>10)",9,"(>100)",null,null,"4'T12-LF9T2A",475,475,413,111]
[null,250,6,"(201-250)",6,"(201-250)",4,"(201-250)",7,"(201-250)",1,"(>3)",4,"(201-250)",3,"(>200)",4,"(201-250)",4,"(201-250)","S","(>10)",9,"(>100)",null,null,"4'T12-LF9T3A",541,541,470,128]
[null,251,7,"(251-300)",7,"(251-300)",5,"(251-300)",8,"(251-300)",1,"(>3)",5,"(251-300)",3,"(>200)",5,"(>250)",5,"(>250)","S","(>10)",9,"(>100)",null,"4'T12-LF10","4'T12-LF10T1A",374,374,325,83]
[null,252,7,"(251-300)",7,"(251-300)",5,"(251-300)",8,"(251-300)",1,"(>3)",5,"(251-300)",3,"(>200)",5,"(>250)",5,"(>250)","S","(>10)",9,"(>100)",null,null,"4'T12-LF10T2A",505,505,439,111]
[null,253,7,"(251-300)",7,"(251-300)",5,"(251-300)",8,"(251-300)",1,"(>3)",5,"(251-300)",3,"(>200)",5,"(>250)",5,"(>250)","S","(>10)",9,"(>100)",null,null,"4'T12-LF10T3A",575,575,500,128]
[null,254,7,"(251-300)",7,"(251-300)",5,"(251-300)",8,"(251-300)",1,"(>3)",5,"(251-300)",3,"(>200)",5,"(>250)",5,"(>250)","S","(>10)",9,"(>100)",null,"4'T12-LF11","4'T12-LF11T1A",409,409,356,83]
[null,255,7,"(251-300)",7,"(251-300)",5,"(251-300)",8,"(251-300)",1,"(>3)",5,"(251-300)",3,"(>200)",5,"(>250)",5,"(>250)","S","(>10)",9,"(>100)",null,null,"4'T12-LF11T2A",553,553,481,111]
[null,256,7,"(251-300)",7,"(251-300)",5,"(251-300)",8,"(251-300)",1,"(>3)",5,"(251-300)",3,"(>200)",5,"(>250)",5,"(>250)","S","(>10)",9,"(>100)",null,null,"4'T12-LF11T3A",631,631,549,128]
[null,257,7,"(251-300)",7,"(251-300)",5,"(251-300)",8,"(251-300)",1,"(>3)",5,"(251-300)",3,"(>200)",5,"(>250)",5,"(>250)","S","(>10)",9,"(>100)",null,"8'T12-LLD1","8'T12-LLD1T1A",4,4,4,4]
[null,258,7,"(251-300)",7,"(251-300)",5,"(251-300)",8,"(251-300)",1,"(>3)",5,"(251-300)",3,"(>200)",5,"(>250)",5,"(>250)","S","(>10)",9,"(>100)",null,null,"8'T12-LLD1T2A",4,4,4,4]
[null,259,7,"(251-300)",7,"(251-300)",5,"(251-300)",8,"(251-300)",1,"(>3)",5,"(251-300)",3,"(>200)",5,"(>250)",5,"(>250)","S","(>10)",9,"(>100)",null,null,"8'T12-LLD1T3A",4,4,4,4]
[null,260,7,"(251-300)",7,"(251-300)",5,"(251-300)",8,"(251-300)",1,"(>3)",5,"(251-300)",3,"(>200)",5,"(>250)",5,"(>250)","S","(>10)",9,"(>100)",null,"8'T12-LLD2","8'T12-LLD2T1A",4,4,4,4]
[null,261,7,"(251-300)",7,"(251-300)",5,"(251-300)",8,"(251-300)",1,"(>3)",5,"(251-300)",3,"(>200)",5,"(>250)",5,"(>250)","S","(>10)",9,"(>100)",null,null,"8'T12-LLD2T2A",4,4,4,4]
[null,262,7,"(251-300)",7,"(251-300)",5,"(251-300)",8,"(251-300)",1,"(>3)",5,"(251-300)",3,"(>200)",5,"(>250)",5,"(>250)","S","(>10)",9,"(>100)",null,null,"8'T12-LLD2T3A",4,4,4,4]
[null,263,7,"(251-300)",7,"(251-300)",5,"(251-300)",8,"(251-300)",1,"(>3)",5,"(251-300)",3,"(>200)",5,"(>250)",5,"(>250)","S","(>10)",9,"(>100)",null,"8'T12-LLD3","8'T12-LLD3T1A",4,4,4,4]
[null,264,7,"(251-300)",7,"(251-300)",5,"(251-300)",8,"(251-300)",1,"(>3)",5,"(251-300)",3,"(>200)",5,"(>250)",5,"(>250)","S","(>10)",9,"(>100)",null,null,"8'T12-LLD3T2A",4,4,4,4]
[null,265,7,"(251-300)",7,"(251-300)",5,"(251-300)",8,"(251-300)",1,"(>3)",5,"(251-300)",3,"(>200)",5,"(>250)",5,"(>250)","S","(>10)",9,"(>100)",null,null,"8'T12-LLD3T3A",4,4,4,4]
[null,266,7,"(251-300)",7,"(251-300)",5,"(251-300)",{"$f":"C271+1","v":8},{"$f":"D271","v":"(251-300)"},1,"(>3)",5,"(251-300)",3,"(>200)",5,"(>250)",5,"(>250)","S","(>10)",9,"(>100)",null,"8'T12-LLD4","8'T12-LLD4T1A",4,4,4,4]
[null,267,7,"(251-300)",7,"(251-300)",5,"(251-300)",8,"(251-300)",1,"(>3)",5,"(251-300)",3,"(>200)",5,"(>250)",5,"(>250)","S","(>10)",9,"(>100)",null,null,"8'T12-LLD4T2A",4,4,4,4]
[null,268,7,"(251-300)",7,"(251-300)",5,"(251-300)",8,"(251-300)",1,"(>3)",5,"(251-300)",3,"(>200)",5,"(>250)",5,"(>250)","S","(>10)",9,"(>100)",null,null,"8'T12-LLD4T3A",4,4,4,4]
[null,269,7,"(251-300)",7,"(251-300)",5,"(251-300)",8,"(251-300)",1,"(>3)",5,"(251-300)",3,"(>200)",5,"(>250)",5,"(>250)","S","(>10)",9,"(>100)",null,"8'T12-LLD5","8'T12-LLD5T1A",4,4,4,4]
[null,270,7,"(251-300)",7,"(251-300)",5,"(251-300)",8,"(251-300)",1,"(>3)",5,"(251-300)",3,"(>200)",5,"(>250)",5,"(>250)","S","(>10)",9,"(>100)",null,null,"8'T12-LLD5T2A",4,4,4,4]
[null,271,7,"(251-300)",7,"(251-300)",5,"(251-300)",8,"(251-300)",1,"(>3)",5,"(251-300)",3,"(>200)",5,"(>250)",5,"(>250)","S","(>10)",9,"(>100)",null,null,"8'T12-LLD5T3A",4,4,4,4]
[null,272,7,"(251-300)",7,"(251-300)",5,"(251-300)",8,"(251-300)",1,"(>3)",5,"(251-300)",3,"(>200)",5,"(>250)",5,"(>250)","S","(>10)",9,"(>100)",null,"8'T12-LLD6","8'T12-LLD6T1A",4,4,4,4]
[null,273,7,"(251-300)",7,"(251-300)",5,"(251-300)",8,"(251-300)",1,"(>3)",5,"(251-300)",3,"(>200)",5,"(>250)",5,"(>250)","S","(>10)",9,"(>100)",null,null,"8'T12-LLD6T2A",4,4,4,4]
[null,274,7,"(251-300)",7,"(251-300)",5,"(251-300)",8,"(251-300)",1,"(>3)",5,"(251-300)",3,"(>200)",5,"(>250)",5,"(>250)","S","(>10)",9,"(>100)",null,null,"8'T12-LLD6T3A",4,4,4,4]
[null,275,7,"(251-300)",7,"(251-300)",5,"(251-300)",8,"(251-300)",1,"(>3)",5,"(251-300)",3,"(>200)",5,"(>250)",5,"(>250)","S","(>10)",9,"(>100)",null,"8'T12-LLD7","8'T12-LLD7T1A",4,4,4,4]
[null,276,7,"(251-300)",7,"(251-300)",5,"(251-300)",8,"(251-300)",1,"(>3)",5,"(251-300)",3,"(>200)",5,"(>250)",5,"(>250)","S","(>10)",9,"(>100)",null,null,"8'T12-LLD7T2A",4,4,4,4]
[null,277,7,"(251-300)",7,"(251-300)",5,"(251-300)",8,"(251-300)",1,"(>3)",5,"(251-300)",3,"(>200)",5,"(>250)",5,"(>250)","S","(>10)",9,"(>100)",null,null,"8'T12-LLD7T3A",4,4,4,4]
[null,278,7,"(251-300)",7,"(251-300)",5,"(251-300)",8,"(251-300)",1,"(>3)",5,"(251-300)",3,"(>200)",5,"(>250)",5,"(>250)","S","(>10)",9,"(>100)",null,"8'T12-LLD8","8'T12-LLD8T1A",4,4,4,4]
[null,279,7,"(251-300)",7,"(251-300)",5,"(251-300)",8,"(251-300)",1,"(>3)",5,"(251-300)",3,"(>200)",5,"(>250)",5,"(>250)","S","(>10)",9,"(>100)",null,null,"8'T12-LLD8T2A",4,4,4,4]
[null,280,7,"(251-300)",7,"(251-300)",5,"(251-300)",8,"(251-300)",1,"(>3)",5,"(251-300)",3,"(>200)",5,"(>250)",5,"(>250)","S","(>10)",9,"(>100)",null,null,"8'T12-LLD8T3A",4,4,4,4]
[null,281,7,"(251-300)",7,"(251-300)",5,"(251-300)",8,"(251-300)",1,"(>3)",5,"(251-300)",3,"(>200)",5,"(>250)",5,"(>250)","S","(>10)",9,"(>100)",null,"8'T12-LLD9","8'T12-LLD9T1A",4,4,4,4]
[null,282,7,"(251-300)",7,"(251-300)",5,"(251-300)",8,"(251-300)",1,"(>3)",5,"(251-300)",3,"(>200)",5,"(>250)",5,"(>250)","S","(>10)",9,"(>100)",null,null,"8'T12-LLD9T2A",4,4,4,4]
[null,283,7,"(251-300)",7,"(251-300)",5,"(251-300)",8,"(251-300)",1,"(>3)",5,"(251-300)",3,"(>200)",5,"(>250)",5,"(>250)","S","(>10)",9,"(>100)",null,null,"8'T12-LLD9T3A",4,4,4,4]
[null,284,7,"(251-300)",7,"(251-300)",5,"(251-300)",8,"(251-300)",1,"(>3)",5,"(251-300)",3,"(>200)",5,"(>250)",5,"(>250)","S","(>10)",9,"(>100)",null,"8'T12-LK1","8'T12-LK1T1A",55,55,36,29]
[null,285,7,"(251-300)",7,"(251-300)",5,"(251-300)",8,"(251-300)",1,"(>3)",5,"(251-300)",3,"(>200)",5,"(>250)",5,"(>250)","S","(>10)",9,"(>100)",null,null,"8'T12-LK1T2A",74,74,48,38]
[null,286,7,"(251-300)",7,"(251-300)",5,"(251-300)",8,"(251-300)",1,"(>3)",5,"(251-300)",3,"(>200)",5,"(>250)",5,"(>250)","S","(>10)",9,"(>100)",null,null,"8'T12-LK1T3A",84,84,55,44]
[null,287,7,"(251-300)",7,"(251-300)",5,"(251-300)",8,"(251-300)",1,"(>3)",5,"(251-300)",3,"(>200)",5,"(>250)",5,"(>250)","S","(>10)",9,"(>100)",null,"8'T12-LK2","8'T12-LK2T1A",81,81,51,41]
[null,288,7,"(251-300)",7,"(251-300)",5,"(251-300)",8,"(251-300)",1,"(>3)",5,"(251-300)",3,"(>200)",5,"(>250)",5,"(>250)","S","(>10)",9,"(>100)",null,null,"8'T12-LK2T2A",108,108,70,56]
[null,289,7,"(251-300)",7,"(251-300)",5,"(251-300)",8,"(251-300)",1,"(>3)",5,"(251-300)",3,"(>200)",5,"(>250)",5,"(>250)","S","(>10)",9,"(>100)",null,null,"8'T12-LK2T3A",124,124,81,65]
[null,290,7,"(251-300)",7,"(251-300)",5,"(251-300)",8,"(251-300)",1,"(>3)",5,"(251-300)",3,"(>200)",5,"(>250)",5,"(>250)","S","(>10)",9,"(>100)",null,"8'T12-LK3","8'T12-LK3T1A",177,177,89,54]
[null,291,7,"(251-300)",7,"(251-300)",5,"(251-300)",8,"(251-300)",1,"(>3)",5,"(251-300)",3,"(>200)",5,"(>250)",5,"(>250)","S","(>10)",9,"(>100)",null,null,"8'T12-LK3T2A",237,237,120,73]
[null,292,7,"(251-300)",7,"(251-300)",5,"(251-300)",8,"(251-300)",1,"(>3)",5,"(251-300)",3,"(>200)",5,"(>250)",5,"(>250)","S","(>10)",9,"(>100)",null,null,"8'T12-LK3T3A",271,271,136,83]
[null,293,7,"(251-300)",7,"(251-300)",5,"(251-300)",8,"(251-300)",1,"(>3)",5,"(251-300)",3,"(>200)",5,"(>250)",5,"(>250)","S","(>10)",9,"(>100)",null,"8'T12-LK4","8'T12-LK4T1A",252,252,119,63]
[null,294,7,"(251-300)",7,"(251-300)",5,"(251-300)",8,"(251-300)",1,"(>3)",5,"(251-300)",3,"(>200)",5,"(>250)",5,"(>250)","S","(>10)",9,"(>100)",null,null,"8'T12-LK4T2A",338,338,160,85]
[null,295,7,"(251-300)",7,"(251-300)",5,"(251-300)",8,"(251-300)",1,"(>3)",5,"(251-300)",3,"(>200)",5,"(>250)",5,"(>250)","S","(>10)",9,"(>100)",null,null,"8'T12-LK4T3A",386,386,183,98]
[null,296,7,"(251-300)",7,"(251-300)",5,"(251-300)",8,"(251-300)",1,"(>3)",5,"(251-300)",3,"(>200)",5,"(>250)",5,"(>250)","S","(>10)",9,"(>100)",null,"8'T12-LK5","8'T12-LK5T1A",289,289,126,63]
[null,297,7,"(251-300)",7,"(251-300)",5,"(251-300)",8,"(251-300)",1,"(>3)",5,"(251-300)",3,"(>200)",5,"(>250)",5,"(>250)","S","(>10)",9,"(>100)",null,null,"8'T12-LK5T2A",392,392,173,85]
[null,298,7,"(251-300)",7,"(251-300)",5,"(251-300)",8,"(251-300)",1,"(>3)",5,"(251-300)",3,"(>200)",5,"(>250)",5,"(>250)","S","(>10)",9,"(>100)",null,null,"8'T12-LK5T3A",446,446,195,98]
[null,299,7,"(251-300)",7,"(251-300)",5,"(251-300)",8,"(251-300)",1,"(>3)",5,"(251-300)",3,"(>200)",5,"(>250)",5,"(>250)","S","(>10)",9,"(>100)",null,"8'T12-LK6","8'T12-LK6T1A",323,323,129,63]
[null,300,7,"(251-300)",7,"(251-300)",5,"(251-300)",8,"(251-300)",1,"(>3)",5,"(251-300)",3,"(>200)",5,"(>250)",5,"(>250)","S","(>10)",9,"(>100)",null,null,"8'T12-LK6T2A",437,437,174,85]
[null,301,8,"(301-350)",8,"(301-350)",6,"(301-350)",9,"(301-350)",1,"(>3)",6,"(301-350)",3,"(>200)",5,"(>250)",5,"(>250)","S","(>10)",9,"(>100)",null,null,"8'T12-LK6T3A",498,498,199,98]
[null,302,8,"(301-350)",8,"(301-350)",6,"(301-350)",9,"(301-350)",1,"(>3)",6,"(301-350)",3,"(>200)",5,"(>250)",5,"(>250)","S","(>10)",9,"(>100)",null,"8'T12-LK7","8'T12-LK7T1A",351,351,136,63]
[null,303,8,"(301-350)",8,"(301-350)",6,"(301-350)",9,"(301-350)",1,"(>3)",6,"(301-350)",3,"(>200)",5,"(>250)",5,"(>250)","S","(>10)",9,"(>100)",null,null,"8'T12-LK7T2A",475,475,183,85]
[null,304,8,"(301-350)",8,"(301-350)",6,"(301-350)",9,"(301-350)",1,"(>3)",6,"(301-350)",3,"(>200)",5,"(>250)",5,"(>250)","S","(>10)",9,"(>100)",null,null,"8'T12-LK7T3A",541,541,210,98]
[null,305,8,"(301-350)",8,"(301-350)",6,"(301-350)",9,"(301-350)",1,"(>3)",6,"(301-350)",3,"(>200)",5,"(>250)",5,"(>250)","S","(>10)",9,"(>100)",null,"8'T12-LK8","8'T12-LK8T1A",374,374,140,63]
[null,306,8,"(301-350)",8,"(301-350)",6,"(301-350)",9,"(301-350)",1,"(>3)",6,"(301-350)",3,"(>200)",5,"(>250)",5,"(>250)","S","(>10)",9,"(>100)",null,null,"8'T12-LK8T2A",505,505,189,85]
[null,307,8,"(301-350)",8,"(301-350)",6,"(301-350)",9,"(301-350)",1,"(>3)",6,"(301-350)",3,"(>200)",5,"(>250)",5,"(>250)","S","(>10)",9,"(>100)",null,null,"8'T12-LK8T3A",575,575,216,98]
[null,308,8,"(301-350)",8,"(301-350)",6,"(301-350)",9,"(301-350)",1,"(>3)",6,"(301-350)",3,"(>200)",5,"(>250)",5,"(>250)","S","(>10)",9,"(>100)",null,"8'T12-LK9","8'T12-LK9T1A",409,409,156,63]
[null,309,8,"(301-350)",8,"(301-350)",6,"(301-350)",9,"(301-350)",1,"(>3)",6,"(301-350)",3,"(>200)",5,"(>250)",5,"(>250)","S","(>10)",9,"(>100)",null,null,"8'T12-LK9T2A",553,553,211,85]
[null,310,8,"(301-350)",8,"(301-350)",6,"(301-350)",9,"(301-350)",1,"(>3)",6,"(301-350)",3,"(>200)",5,"(>250)",5,"(>250)","S","(>10)",9,"(>100)",null,null,"8'T12-LK9T3A",631,631,241,98]
[null,311,8,"(301-350)",8,"(301-350)",6,"(301-350)",9,"(301-350)",1,"(>3)",6,"(301-350)",3,"(>200)",5,"(>250)",5,"(>250)","S","(>10)",9,"(>100)",null,"8'T12-LF1","8'T12-LF1T1A",55,55,48,38]
[null,312,8,"(301-350)",8,"(301-350)",6,"(301-350)",9,"(301-350)",1,"(>3)",6,"(301-350)",3,"(>200)",5,"(>250)",5,"(>250)","S","(>10)",9,"(>100)",null,null,"8'T12-LF1T2A",74,74,64,51]
[null,313,8,"(301-350)",8,"(301-350)",6,"(301-350)",9,"(301-350)",1,"(>3)",6,"(301-350)",3,"(>200)",5,"(>250)",5,"(>250)","S","(>10)",9,"(>100)",null,null,"8'T12-LF1T3A",84,84,73,58]
[null,314,8,"(301-350)",8,"(301-350)",6,"(301-350)",9,"(301-350)",1,"(>3)",6,"(301-350)",3,"(>200)",5,"(>250)",5,"(>250)","S","(>10)",9,"(>100)",null,"8'T12-LF2","8'T12-LF2T1A",81,81,70,56]
[null,315,8,"(301-350)",8,"(301-350)",6,"(301-350)",9,"(301-350)",1,"(>3)",6,"(301-350)",3,"(>200)",5,"(>250)",5,"(>250)","S","(>10)",9,"(>100)",null,null,"8'T12-LF2T2A",108,108,94,75]
[null,316,8,"(301-350)",8,"(301-350)",6,"(301-350)",9,"(301-350)",1,"(>3)",6,"(301-350)",3,"(>200)",5,"(>250)",5,"(>250)","S","(>10)",9,"(>100)",null,null,"8'T12-LF2T3A",124,124,108,86]
[null,317,8,"(301-350)",8,"(301-350)",6,"(301-350)",9,"(301-350)",1,"(>3)",6,"(301-350)",3,"(>200)",5,"(>250)",5,"(>250)","S","(>10)",9,"(>100)",null,"8'T12-LF3","8'T12-LF3T1A",177,177,154,73]
[null,318,8,"(301-350)",8,"(301-350)",6,"(301-350)",9,"(301-350)",1,"(>3)",6,"(301-350)",3,"(>200)",5,"(>250)",5,"(>250)","S","(>10)",9,"(>100)",null,null,"8'T12-LF3T2A",237,237,206,98]
[null,319,8,"(301-350)",8,"(301-350)",6,"(301-350)",9,"(301-350)",1,"(>3)",6,"(301-350)",3,"(>200)",5,"(>250)",5,"(>250)","S","(>10)",9,"(>100)",null,null,"8'T12-LF3T3A",271,271,236,111]
[null,320,8,"(301-350)",8,"(301-350)",6,"(301-350)",9,"(301-350)",1,"(>3)",6,"(301-350)",3,"(>200)",5,"(>250)",5,"(>250)","S","(>10)",9,"(>100)",null,"8'T12-LF4","8'T12-LF4T1A",252,252,219,84]
[null,321,8,"(301-350)",8,"(301-350)",6,"(301-350)",9,"(301-350)",1,"(>3)",6,"(301-350)",3,"(>200)",5,"(>250)",5,"(>250)","S","(>10)",9,"(>100)",null,null,"8'T12-LF4T2A",338,338,294,113]
[null,322,8,"(301-350)",8,"(301-350)",6,"(301-350)",9,"(301-350)",1,"(>3)",6,"(301-350)",3,"(>200)",5,"(>250)",5,"(>250)","S","(>10)",9,"(>100)",null,null,"8'T12-LF4T3A",386,386,336,130]
[null,323,8,"(301-350)",8,"(301-350)",6,"(301-350)",9,"(301-350)",1,"(>3)",6,"(301-350)",3,"(>200)",5,"(>250)",5,"(>250)","S","(>10)",9,"(>100)",null,"8'T12-LF5","8'T12-LF5T1A",289,289,251,84]
[null,324,8,"(301-350)",8,"(301-350)",6,"(301-350)",9,"(301-350)",1,"(>3)",6,"(301-350)",3,"(>200)",5,"(>250)",5,"(>250)","S","(>10)",9,"(>100)",null,null,"8'T12-LF5T2A",392,392,341,113]
[null,325,8,"(301-350)",8,"(301-350)",6,"(301-350)",9,"(301-350)",1,"(>3)",6,"(301-350)",3,"(>200)",5,"(>250)",5,"(>250)","S","(>10)",9,"(>100)",null,null,"8'T12-LF5T3A",446,446,388,130]
[null,326,8,"(301-350)",8,"(301-350)",6,"(301-350)",9,"(301-350)",1,"(>3)",6,"(301-350)",3,"(>200)",5,"(>250)",5,"(>250)","S","(>10)",9,"(>100)",null,"8'T12-LF6","8'T12-LF6T1A",323,323,281,84]
[null,327,8,"(301-350)",8,"(301-350)",6,"(301-350)",9,"(301-350)",1,"(>3)",6,"(301-350)",3,"(>200)",5,"(>250)",5,"(>250)","S","(>10)",9,"(>100)",null,null,"8'T12-LF6T2A",437,437,380,113]
[null,328,8,"(301-350)",8,"(301-350)",6,"(301-350)",9,"(301-350)",1,"(>3)",6,"(301-350)",3,"(>200)",5,"(>250)",5,"(>250)","S","(>10)",9,"(>100)",null,null,"8'T12-LF6T3A",498,498,433,130]
[null,329,8,"(301-350)",8,"(301-350)",6,"(301-350)",9,"(301-350)",1,"(>3)",6,"(301-350)",3,"(>200)",5,"(>250)",5,"(>250)","S","(>10)",9,"(>100)",null,"8'T12-LF7","8'T12-LF7T1A",351,351,305,84]
[null,330,8,"(301-350)",8,"(301-350)",6,"(301-350)",{"$f":"C335+1","v":9},{"$f":"D335","v":"(301-350)"},1,"(>3)",6,"(301-350)",3,"(>200)",5,"(>250)",5,"(>250)","S","(>10)",9,"(>100)",null,null,"8'T12-LF7T2A",475,475,413,113]
[null,331,8,"(301-350)",8,"(301-350)",6,"(301-350)",9,"(301-350)",1,"(>3)",6,"(301-350)",3,"(>200)",5,"(>250)",5,"(>250)","S","(>10)",9,"(>100)",null,null,"8'T12-LF7T3A",541,541,470,130]
[null,332,8,"(301-350)",8,"(301-350)",6,"(301-350)",9,"(301-350)",1,"(>3)",6,"(301-350)",3,"(>200)",5,"(>250)",5,"(>250)","S","(>10)",9,"(>100)",null,"8'T12-LF8","8'T12-LF8T1A",374,374,325,84]
[null,333,8,"(301-350)",8,"(301-350)",6,"(301-350)",9,"(301-350)",1,"(>3)",6,"(301-350)",3,"(>200)",5,"(>250)",5,"(>250)","S","(>10)",9,"(>100)",null,null,"8'T12-LF8T2A",505,505,439,113]
[null,334,8,"(301-350)",8,"(301-350)",6,"(301-350)",9,"(301-350)",1,"(>3)",6,"(301-350)",3,"(>200)",5,"(>250)",5,"(>250)","S","(>10)",9,"(>100)",null,null,"8'T12-LF8T3A",575,575,500,130]
[null,335,8,"(301-350)",8,"(301-350)",6,"(301-350)",9,"(301-350)",1,"(>3)",6,"(301-350)",3,"(>200)",5,"(>250)",5,"(>250)","S","(>10)",9,"(>100)",null,"8'T12-LF9","8'T12-LF9T1A",409,409,356,84]
[null,336,8,"(301-350)",8,"(301-350)",6,"(301-350)",9,"(301-350)",1,"(>3)",6,"(301-350)",3,"(>200)",5,"(>250)",5,"(>250)","S","(>10)",9,"(>100)",null,null,"8'T12-LF9T2A",553,553,481,113]
[null,337,8,"(301-350)",8,"(301-350)",6,"(301-350)",9,"(301-350)",1,"(>3)",6,"(301-350)",3,"(>200)",5,"(>250)",5,"(>250)","S","(>10)",9,"(>100)",null,null,"8'T12-LF9T3A",631,631,549,130]
[null,338,8,"(301-350)",8,"(301-350)",6,"(301-350)",9,"(301-350)",1,"(>3)",6,"(301-350)",3,"(>200)",5,"(>250)",5,"(>250)","S","(>10)",9,"(>100)","Here","HL1","HL1T1A",26,26,23,18,null,{"$f":"AD343/AH343","v":0.184},{"$f":"50*2500/1000","v":125}]
[null,339,8,"(301-350)",8,"(301-350)",6,"(301-350)",9,"(301-350)",1,"(>3)",6,"(301-350)",3,"(>200)",5,"(>250)",5,"(>250)","S","(>10)",9,"(>100)",null,null,"HL1T2A",35,35,30,24,null,{"$f":"AD344/AH344","v":0.14285714285714285},{"$f":"50*4200/1000","v":210}]
[null,340,8,"(301-350)",8,"(301-350)",6,"(301-350)",9,"(301-350)",1,"(>3)",6,"(301-350)",3,"(>200)",5,"(>250)",5,"(>250)","S","(>10)",9,"(>100)",null,null,"HL1T3A",40,40,35,28,null,0.1076923076923077,{"$f":"50*6500/1000","v":325}]
[null,341,8,"(301-350)",8,"(301-350)",6,"(301-350)",9,"(301-350)",1,"(>3)",6,"(301-350)",3,"(>200)",5,"(>250)",5,"(>250)","S","(>10)",9,"(>100)",null,"HL2","HL2T1A",52,52,45,36]
[null,342,8,"(301-350)",8,"(301-350)",6,"(301-350)",9,"(301-350)",1,"(>3)",6,"(301-350)",3,"(>200)",5,"(>250)",5,"(>250)","S","(>10)",9,"(>100)",null,null,"HL2T2A",70,70,61,49]
[null,343,8,"(301-350)",8,"(301-350)",6,"(301-350)",9,"(301-350)",1,"(>3)",6,"(301-350)",3,"(>200)",5,"(>250)",5,"(>250)","S","(>10)",9,"(>100)",null,null,"HL2T3A",81,81,70,56]
[null,344,8,"(301-350)",8,"(301-350)",6,"(301-350)",9,"(301-350)",1,"(>3)",6,"(301-350)",3,"(>200)",5,"(>250)",5,"(>250)","S","(>10)",9,"(>100)",null,"HL3","HL3T1A",61,61,53,42]
[null,345,8,"(301-350)",8,"(301-350)",6,"(301-350)",9,"(301-350)",1,"(>3)",6,"(301-350)",3,"(>200)",5,"(>250)",5,"(>250)","S","(>10)",9,"(>100)",null,null,"HL3T2A",82,82,71,57]
[null,346,8,"(301-350)",8,"(301-350)",6,"(301-350)",9,"(301-350)",1,"(>3)",6,"(301-350)",3,"(>200)",5,"(>250)",5,"(>250)","S","(>10)",9,"(>100)",null,null,"HL3T3A",93,93,81,65]
[null,347,8,"(301-350)",8,"(301-350)",6,"(301-350)",9,"(301-350)",1,"(>3)",6,"(301-350)",3,"(>200)",5,"(>250)",5,"(>250)","S","(>10)",9,"(>100)",null,"HK1","HK1T1A",30,30,26,21,null,{"$f":"AD352/AH352","v":0.20799999999999999},{"$f":"50*2500/1000","v":125}]
[null,348,8,"(301-350)",8,"(301-350)",6,"(301-350)",9,"(301-350)",1,"(>3)",6,"(301-350)",3,"(>200)",5,"(>250)",5,"(>250)","S","(>10)",9,"(>100)",null,null,"HK1T2A",40,40,35,28,null,{"$f":"AD353/AH353","v":0.16666666666666666},{"$f":"50*4200/1000","v":210}]
[null,349,8,"(301-350)",8,"(301-350)",6,"(301-350)",9,"(301-350)",1,"(>3)",6,"(301-350)",3,"(>200)",5,"(>250)",5,"(>250)","S","(>10)",9,"(>100)",null,null,"HK1T3A",45,45,39,31,null,{"$f":"AD354/AH354","v":0.12},{"$f":"50*6500/1000","v":325}]
[null,350,8,"(301-350)",8,"(301-350)",6,"(301-350)",9,"(301-350)",1,"(>3)",6,"(301-350)",3,"(>200)",5,"(>250)",5,"(>250)","S","(>10)",9,"(>100)",null,"HK2","HK2T1A",58,58,50,40]
[null,351,9,"(351-400)",9,"(351-400)",7,"(351-400)",10,"(351-400)",1,"(>3)",7,"(351-400)",3,"(>200)",5,"(>250)",5,"(>250)","S","(>10)",9,"(>100)",null,null,"HK2T2A",78,78,68,54]
[null,352,9,"(351-400)",9,"(351-400)",7,"(351-400)",10,"(351-400)",1,"(>3)",7,"(351-400)",3,"(>200)",5,"(>250)",5,"(>250)","S","(>10)",9,"(>100)",null,null,"HK2T3A",87,87,76,61]
[null,353,9,"(351-400)",9,"(351-400)",7,"(351-400)",10,"(351-400)",1,"(>3)",7,"(351-400)",3,"(>200)",5,"(>250)",5,"(>250)","S","(>10)",9,"(>100)",null,"HK3","HK3T1A",102,102,89,71]
[null,354,9,"(351-400)",9,"(351-400)",7,"(351-400)",10,"(351-400)",1,"(>3)",7,"(351-400)",3,"(>200)",5,"(>250)",5,"(>250)","S","(>10)",9,"(>100)",null,null,"HK3T2A",138,138,120,96]
[null,355,9,"(351-400)",9,"(351-400)",7,"(351-400)",10,"(351-400)",1,"(>3)",7,"(351-400)",3,"(>200)",5,"(>250)",5,"(>250)","S","(>10)",9,"(>100)",null,null,"HK3T3A",156,156,136,109]
[null,356,9,"(351-400)",9,"(351-400)",7,"(351-400)",10,"(351-400)",1,"(>3)",7,"(351-400)",3,"(>200)",5,"(>250)",5,"(>250)","S","(>10)",9,"(>100)",null,"HK4","HK4T1A",137,137,119,95]
[null,357,9,"(351-400)",9,"(351-400)",7,"(351-400)",10,"(351-400)",1,"(>3)",7,"(351-400)",3,"(>200)",5,"(>250)",5,"(>250)","S","(>10)",9,"(>100)",null,null,"HK4T2A",184,184,160,128]
[null,358,9,"(351-400)",9,"(351-400)",7,"(351-400)",10,"(351-400)",1,"(>3)",7,"(351-400)",3,"(>200)",5,"(>250)",5,"(>250)","S","(>10)",9,"(>100)",null,null,"HK4T3A",210,210,183,146]
[null,359,9,"(351-400)",9,"(351-400)",7,"(351-400)",10,"(351-400)",1,"(>3)",7,"(351-400)",3,"(>200)",5,"(>250)",5,"(>250)","S","(>10)",9,"(>100)",null,"HK5","HK5T1A",145,145,126,101]
[null,360,9,"(351-400)",9,"(351-400)",7,"(351-400)",10,"(351-400)",1,"(>3)",7,"(351-400)",3,"(>200)",5,"(>250)",5,"(>250)","S","(>10)",9,"(>100)",null,null,"HK5T2A",199,199,173,138]
[null,361,9,"(351-400)",9,"(351-400)",7,"(351-400)",10,"(351-400)",1,"(>3)",7,"(351-400)",3,"(>200)",5,"(>250)",5,"(>250)","S","(>10)",9,"(>100)",null,null,"HK5T3A",224,224,195,156]
[null,362,9,"(351-400)",9,"(351-400)",7,"(351-400)",10,"(351-400)",1,"(>3)",7,"(351-400)",3,"(>200)",5,"(>250)",5,"(>250)","S","(>10)",9,"(>100)",null,"HK6","HK6T1A",148,148,129,103]
[null,363,9,"(351-400)",9,"(351-400)",7,"(351-400)",10,"(351-400)",1,"(>3)",7,"(351-400)",3,"(>200)",5,"(>250)",5,"(>250)","S","(>10)",9,"(>100)",null,null,"HK6T2A",200,200,174,139]
[null,364,9,"(351-400)",9,"(351-400)",7,"(351-400)",10,"(351-400)",1,"(>3)",7,"(351-400)",3,"(>200)",5,"(>250)",5,"(>250)","S","(>10)",9,"(>100)",null,null,"HK6T3A",229,229,199,159]
[null,365,9,"(351-400)",9,"(351-400)",7,"(351-400)",10,"(351-400)",1,"(>3)",7,"(351-400)",3,"(>200)",5,"(>250)",5,"(>250)","S","(>10)",9,"(>100)",null,"HK7","HK7T1A",156,156,136,109]
[null,366,9,"(351-400)",9,"(351-400)",7,"(351-400)",10,"(351-400)",1,"(>3)",7,"(351-400)",3,"(>200)",5,"(>250)",5,"(>250)","S","(>10)",9,"(>100)",null,null,"HK7T2A",210,210,183,146]
[null,367,9,"(351-400)",9,"(351-400)",7,"(351-400)",10,"(351-400)",1,"(>3)",7,"(351-400)",3,"(>200)",5,"(>250)",5,"(>250)","S","(>10)",9,"(>100)",null,null,"HK7T3A",242,242,210,168]
[null,368,9,"(351-400)",9,"(351-400)",7,"(351-400)",10,"(351-400)",1,"(>3)",7,"(351-400)",3,"(>200)",5,"(>250)",5,"(>250)","S","(>10)",9,"(>100)",null,"HK8","HK8T1A",161,161,140,112]
[null,369,9,"(351-400)",9,"(351-400)",7,"(351-400)",10,"(351-400)",1,"(>3)",7,"(351-400)",3,"(>200)",5,"(>250)",5,"(>250)","S","(>10)",9,"(>100)",null,null,"HK8T2A",217,217,189,151]
[null,370,9,"(351-400)",9,"(351-400)",7,"(351-400)",10,"(351-400)",1,"(>3)",7,"(351-400)",3,"(>200)",5,"(>250)",5,"(>250)","S","(>10)",9,"(>100)",null,null,"HK8T3A",248,248,216,173]
[null,371,9,"(351-400)",9,"(351-400)",7,"(351-400)",10,"(351-400)",1,"(>3)",7,"(351-400)",3,"(>200)",5,"(>250)",5,"(>250)","S","(>10)",9,"(>100)",null,"HK9","HK9T1A",179,179,156,125]
[null,372,9,"(351-400)",9,"(351-400)",7,"(351-400)",10,"(351-400)",1,"(>3)",7,"(351-400)",3,"(>200)",5,"(>250)",5,"(>250)","S","(>10)",9,"(>100)",null,null,"HK9T2A",243,243,211,169]
[null,373,9,"(351-400)",9,"(351-400)",7,"(351-400)",10,"(351-400)",1,"(>3)",7,"(351-400)",3,"(>200)",5,"(>250)",5,"(>250)","S","(>10)",9,"(>100)",null,null,"HK9T3A",277,277,241,193]
[null,374,9,"(351-400)",9,"(351-400)",7,"(351-400)",10,"(351-400)",1,"(>3)",7,"(351-400)",3,"(>200)",5,"(>250)",5,"(>250)","S","(>10)",9,"(>100)",null,"HF1","HF1T1A",51,51,44,35,null,{"$f":"AD379/AH379","v":0.35199999999999998},{"$f":"50*2500/1000","v":125}]
[null,375,9,"(351-400)",9,"(351-400)",7,"(351-400)",10,"(351-400)",1,"(>3)",7,"(351-400)",3,"(>200)",5,"(>250)",5,"(>250)","S","(>10)",9,"(>100)",null,null,"HF1T2A",67,67,58,46,null,{"$f":"AD380/AH380","v":0.27619047619047621},{"$f":"50*4200/1000","v":210}]
[null,376,9,"(351-400)",9,"(351-400)",7,"(351-400)",10,"(351-400)",1,"(>3)",7,"(351-400)",3,"(>200)",5,"(>250)",5,"(>250)","S","(>10)",9,"(>100)",null,null,"HF1T3A",76,76,66,53,null,{"$f":"AD381/AH381","v":0.20307692307692307},{"$f":"50*6500/1000","v":325}]
[null,377,9,"(351-400)",9,"(351-400)",7,"(351-400)",10,"(351-400)",1,"(>3)",7,"(351-400)",3,"(>200)",5,"(>250)",5,"(>250)","S","(>10)",9,"(>100)",null,"HF2","HF2T1A",98,98,85,68]
[null,378,9,"(351-400)",9,"(351-400)",7,"(351-400)",10,"(351-400)",1,"(>3)",7,"(351-400)",3,"(>200)",5,"(>250)",5,"(>250)","S","(>10)",9,"(>100)",null,null,"HF2T2A",131,131,114,91]
[null,379,9,"(351-400)",9,"(351-400)",7,"(351-400)",10,"(351-400)",1,"(>3)",7,"(351-400)",3,"(>200)",5,"(>250)",5,"(>250)","S","(>10)",9,"(>100)",null,null,"HF2T3A",150,150,130,104]
[null,380,9,"(351-400)",9,"(351-400)",7,"(351-400)",10,"(351-400)",1,"(>3)",7,"(351-400)",3,"(>200)",5,"(>250)",5,"(>250)","S","(>10)",9,"(>100)",null,"HF3","HF3T1A",177,177,154,123]
[null,381,9,"(351-400)",9,"(351-400)",7,"(351-400)",10,"(351-400)",1,"(>3)",7,"(351-400)",3,"(>200)",5,"(>250)",5,"(>250)","S","(>10)",9,"(>100)",null,null,"HF3T2A",237,237,206,165]
[null,382,9,"(351-400)",9,"(351-400)",7,"(351-400)",10,"(351-400)",1,"(>3)",7,"(351-400)",3,"(>200)",5,"(>250)",5,"(>250)","S","(>10)",9,"(>100)",null,null,"HF3T3A",271,271,236,189]
[null,383,9,"(351-400)",9,"(351-400)",7,"(351-400)",10,"(351-400)",1,"(>3)",7,"(351-400)",3,"(>200)",5,"(>250)",5,"(>250)","S","(>10)",9,"(>100)",null,"HF4","HF4T1A",252,252,219,175]
[null,384,9,"(351-400)",9,"(351-400)",7,"(351-400)",10,"(351-400)",1,"(>3)",7,"(351-400)",3,"(>200)",5,"(>250)",5,"(>250)","S","(>10)",9,"(>100)",null,null,"HF4T2A",338,338,294,235]
[null,385,9,"(351-400)",9,"(351-400)",7,"(351-400)",10,"(351-400)",1,"(>3)",7,"(351-400)",3,"(>200)",5,"(>250)",5,"(>250)","S","(>10)",9,"(>100)",null,null,"HF4T3A",386,386,336,269]
[null,386,9,"(351-400)",9,"(351-400)",7,"(351-400)",10,"(351-400)",1,"(>3)",7,"(351-400)",3,"(>200)",5,"(>250)",5,"(>250)","S","(>10)",9,"(>100)",null,"HF5","HF5T1A",289,289,251,201]
[null,387,9,"(351-400)",9,"(351-400)",7,"(351-400)",10,"(351-400)",1,"(>3)",7,"(351-400)",3,"(>200)",5,"(>250)",5,"(>250)","S","(>10)",9,"(>100)",null,null,"HF5T2A",392,392,341,273]
[null,388,9,"(351-400)",9,"(351-400)",7,"(351-400)",10,"(351-400)",1,"(>3)",7,"(351-400)",3,"(>200)",5,"(>250)",5,"(>250)","S","(>10)",9,"(>100)",null,null,"HF5T3A",446,446,388,310]
[null,389,9,"(351-400)",9,"(351-400)",7,"(351-400)",10,"(351-400)",1,"(>3)",7,"(351-400)",3,"(>200)",5,"(>250)",5,"(>250)","S","(>10)",9,"(>100)",null,"HF6","HF6T1A",323,323,281,225]
[null,390,9,"(351-400)",9,"(351-400)",7,"(351-400)",10,"(351-400)",1,"(>3)",7,"(351-400)",3,"(>200)",5,"(>250)",5,"(>250)","S","(>10)",9,"(>100)",null,null,"HF6T2A",437,437,380,304]
[null,391,9,"(351-400)",9,"(351-400)",7,"(351-400)",10,"(351-400)",1,"(>3)",7,"(351-400)",3,"(>200)",5,"(>250)",5,"(>250)","S","(>10)",9,"(>100)",null,null,"HF6T3A",498,498,433,346]
[null,392,9,"(351-400)",9,"(351-400)",7,"(351-400)",10,"(351-400)",1,"(>3)",7,"(351-400)",3,"(>200)",5,"(>250)",5,"(>250)","S","(>10)",9,"(>100)",null,"HF7","HF7T1A",351,351,305,244]
[null,393,9,"(351-400)",9,"(351-400)",7,"(351-400)",10,"(351-400)",1,"(>3)",7,"(351-400)",3,"(>200)",5,"(>250)",5,"(>250)","S","(>10)",9,"(>100)",null,null,"HF7T2A",475,475,413,330]
[null,394,9,"(351-400)",9,"(351-400)",7,"(351-400)",{"$f":"C399+1","v":10},{"$f":"D399","v":"(351-400)"},1,"(>3)",7,"(351-400)",3,"(>200)",5,"(>250)",5,"(>250)","S","(>10)",9,"(>100)",null,null,"HF7T3A",541,541,470,376]
[null,395,9,"(351-400)",9,"(351-400)",7,"(351-400)",10,"(351-400)",1,"(>3)",7,"(351-400)",3,"(>200)",5,"(>250)",5,"(>250)","S","(>10)",9,"(>100)",null,"HF8","HF8T1A",374,374,325,260]
[null,396,9,"(351-400)",9,"(351-400)",7,"(351-400)",10,"(351-400)",1,"(>3)",7,"(351-400)",3,"(>200)",5,"(>250)",5,"(>250)","S","(>10)",9,"(>100)",null,null,"HF8T2A",505,505,439,351]
[null,397,9,"(351-400)",9,"(351-400)",7,"(351-400)",10,"(351-400)",1,"(>3)",7,"(351-400)",3,"(>200)",5,"(>250)",5,"(>250)","S","(>10)",9,"(>100)",null,null,"HF8T3A",575,575,500,400]
[null,398,9,"(351-400)",9,"(351-400)",7,"(351-400)",10,"(351-400)",1,"(>3)",7,"(351-400)",3,"(>200)",5,"(>250)",5,"(>250)","S","(>10)",9,"(>100)",null,"HF9","HF9T1A",409,409,356,285]
[null,399,9,"(351-400)",9,"(351-400)",7,"(351-400)",10,"(351-400)",1,"(>3)",7,"(351-400)",3,"(>200)",5,"(>250)",5,"(>250)","S","(>10)",9,"(>100)",null,null,"HF9T2A",553,553,481,385]
[null,400,9,"(351-400)",9,"(351-400)",7,"(351-400)",10,"(351-400)",1,"(>3)",7,"(351-400)",3,"(>200)",5,"(>250)",5,"(>250)","S","(>10)",9,"(>100)",null,null,"HF9T3A",631,631,549,439]
[null,401,10,"(401-450)",10,"(401-450)",8,"(401-450)",11,"(401-450)",1,"(>3)",8,"(401-450)",3,"(>200)",5,"(>250)",5,"(>250)","S","(>10)",9,"(>100)",null,"OL1","OL1T1A",10,10,9,7]
[null,402,10,"(401-450)",10,"(401-450)",8,"(401-450)",11,"(401-450)",1,"(>3)",8,"(401-450)",3,"(>200)",5,"(>250)",5,"(>250)","S","(>10)",9,"(>100)",null,null,"OL1T2A",16,16,14,11]
[null,403,10,"(401-450)",10,"(401-450)",8,"(401-450)",11,"(401-450)",1,"(>3)",8,"(401-450)",3,"(>200)",5,"(>250)",5,"(>250)","S","(>10)",9,"(>100)",null,null,"OL1T3A",17,17,15,12]
[null,404,10,"(401-450)",10,"(401-450)",8,"(401-450)",11,"(401-450)",1,"(>3)",8,"(401-450)",3,"(>200)",5,"(>250)",5,"(>250)","S","(>10)",9,"(>100)",null,"OL2","OL2T1A",23,23,20,16]
[null,405,10,"(401-450)",10,"(401-450)",8,"(401-450)",11,"(401-450)",1,"(>3)",8,"(401-450)",3,"(>200)",5,"(>250)",5,"(>250)","S","(>10)",9,"(>100)",null,null,"OL2T2A",32,32,28,22]
[null,406,10,"(401-450)",10,"(401-450)",8,"(401-450)",11,"(401-450)",1,"(>3)",8,"(401-450)",3,"(>200)",5,"(>250)",5,"(>250)","S","(>10)",9,"(>100)",null,null,"OL2T3A",36,36,31,25]
[null,407,10,"(401-450)",10,"(401-450)",8,"(401-450)",11,"(401-450)",1,"(>3)",8,"(401-450)",3,"(>200)",5,"(>250)",5,"(>250)","S","(>10)",9,"(>100)",null,"OL3","OL3T1A",29,29,25,20]
[null,408,10,"(401-450)",10,"(401-450)",8,"(401-450)",11,"(401-450)",1,"(>3)",8,"(401-450)",3,"(>200)",5,"(>250)",5,"(>250)","S","(>10)",9,"(>100)",null,null,"OL3T2A",39,39,34,27]
[null,409,10,"(401-450)",10,"(401-450)",8,"(401-450)",11,"(401-450)",1,"(>3)",8,"(401-450)",3,"(>200)",5,"(>250)",5,"(>250)","S","(>10)",9,"(>100)",null,null,"OL3T3A",45,45,39,31]
[null,410,10,"(401-450)",10,"(401-450)",8,"(401-450)",11,"(401-450)",1,"(>3)",8,"(401-450)",3,"(>200)",5,"(>250)",5,"(>250)","S","(>10)",9,"(>100)",null,"OL4","OL4T1A",33,33,29,23]
[null,411,10,"(401-450)",10,"(401-450)",8,"(401-450)",11,"(401-450)",1,"(>3)",8,"(401-450)",3,"(>200)",5,"(>250)",5,"(>250)","S","(>10)",9,"(>100)",null,null,"OL4T2A",45,45,39,31]
[null,412,10,"(401-450)",10,"(401-450)",8,"(401-450)",11,"(401-450)",1,"(>3)",8,"(401-450)",3,"(>200)",5,"(>250)",5,"(>250)","S","(>10)",9,"(>100)",null,null,"OL4T3A",51,51,44,35]
[null,413,10,"(401-450)",10,"(401-450)",8,"(401-450)",11,"(401-450)",1,"(>3)",8,"(401-450)",3,"(>200)",5,"(>250)",5,"(>250)","S","(>10)",9,"(>100)",null,"OL5","OL5T1A",39,39,34,27]
[null,414,10,"(401-450)",10,"(401-450)",8,"(401-450)",11,"(401-450)",1,"(>3)",8,"(401-450)",3,"(>200)",5,"(>250)",5,"(>250)","S","(>10)",9,"(>100)",null,null,"OL5T2A",52,52,45,36]
[null,415,10,"(401-450)",10,"(401-450)",8,"(401-450)",11,"(401-450)",1,"(>3)",8,"(401-450)",3,"(>200)",5,"(>250)",5,"(>250)","S","(>10)",9,"(>100)",null,null,"OL5T3A",59,59,51,41]
[null,416,10,"(401-450)",10,"(401-450)",8,"(401-450)",11,"(401-450)",1,"(>3)",8,"(401-450)",3,"(>200)",5,"(>250)",5,"(>250)","S","(>10)",9,"(>100)",null,"OK1","OK1T1A",35,35,30,24]
[null,417,10,"(401-450)",10,"(401-450)",8,"(401-450)",11,"(401-450)",1,"(>3)",8,"(401-450)",3,"(>200)",5,"(>250)",5,"(>250)","S","(>10)",9,"(>100)",null,null,"OK1T2A",47,47,41,33]
[null,418,10,"(401-450)",10,"(401-450)",8,"(401-450)",11,"(401-450)",1,"(>3)",8,"(401-450)",3,"(>200)",5,"(>250)",5,"(>250)","S","(>10)",9,"(>100)",null,null,"OK1T3A",55,55,48,38]
[null,419,10,"(401-450)",10,"(401-450)",8,"(401-450)",11,"(401-450)",1,"(>3)",8,"(401-450)",3,"(>200)",5,"(>250)",5,"(>250)","S","(>10)",9,"(>100)",null,"OK2","OK2T1A",72,72,63,50]
[null,420,10,"(401-450)",10,"(401-450)",8,"(401-450)",11,"(401-450)",1,"(>3)",8,"(401-450)",3,"(>200)",5,"(>250)",5,"(>250)","S","(>10)",9,"(>100)",null,null,"OK2T2A",98,98,85,68]
[null,421,10,"(401-450)",10,"(401-450)",8,"(401-450)",11,"(401-450)",1,"(>3)",8,"(401-450)",3,"(>200)",5,"(>250)",5,"(>250)","S","(>10)",9,"(>100)",null,null,"OK2T3A",109,109,95,76]
[null,422,10,"(401-450)",10,"(401-450)",8,"(401-450)",11,"(401-450)",1,"(>3)",8,"(401-450)",3,"(>200)",5,"(>250)",5,"(>250)","S","(>10)",9,"(>100)",null,"OK3","OK3T1A",91,91,79,63]
[null,423,10,"(401-450)",10,"(401-450)",8,"(401-450)",11,"(401-450)",1,"(>3)",8,"(401-450)",3,"(>200)",5,"(>250)",5,"(>250)","S","(>10)",9,"(>100)",null,null,"OK3T2A",122,122,106,85]
[null,424,10,"(401-450)",10,"(401-450)",8,"(401-450)",11,"(401-450)",1,"(>3)",8,"(401-450)",3,"(>200)",5,"(>250)",5,"(>250)","S","(>10)",9,"(>100)",null,null,"OK3T3A",138,138,120,96]
[null,425,10,"(401-450)",10,"(401-450)",8,"(401-450)",11,"(401-450)",1,"(>3)",8,"(401-450)",3,"(>200)",5,"(>250)",5,"(>250)","S","(>10)",9,"(>100)",null,"OK4","OK4T1A",105,105,91,73]
[null,426,10,"(401-450)",10,"(401-450)",8,"(401-450)",11,"(401-450)",1,"(>3)",8,"(401-450)",3,"(>200)",5,"(>250)",5,"(>250)","S","(>10)",9,"(>100)",null,null,"OK4T2A",141,141,123,98]
[null,427,10,"(401-450)",10,"(401-450)",8,"(401-450)",11,"(401-450)",1,"(>3)",8,"(401-450)",3,"(>200)",5,"(>250)",5,"(>250)","S","(>10)",9,"(>100)",null,null,"OK4T3A",160,160,139,111]
[null,428,10,"(401-450)",10,"(401-450)",8,"(401-450)",11,"(401-450)",1,"(>3)",8,"(401-450)",3,"(>200)",5,"(>250)",5,"(>250)","S","(>10)",9,"(>100)",null,"OK5","OK5T1A",121,121,105,84]
[null,429,10,"(401-450)",10,"(401-450)",8,"(401-450)",11,"(401-450)",1,"(>3)",8,"(401-450)",3,"(>200)",5,"(>250)",5,"(>250)","S","(>10)",9,"(>100)",null,null,"OK5T2A",162,162,141,113]
[null,430,10,"(401-450)",10,"(401-450)",8,"(401-450)",11,"(401-450)",1,"(>3)",8,"(401-450)",3,"(>200)",5,"(>250)",5,"(>250)","S","(>10)",9,"(>100)",null,null,"OK5T3A",187,187,163,130]
[null,431,10,"(401-450)",10,"(401-450)",8,"(401-450)",11,"(401-450)",1,"(>3)",8,"(401-450)",3,"(>200)",5,"(>250)",5,"(>250)","S","(>10)",9,"(>100)",null,"OF1","OF1T1A",52,52,45,36]
[null,432,10,"(401-450)",10,"(401-450)",8,"(401-450)",11,"(401-450)",1,"(>3)",8,"(401-450)",3,"(>200)",5,"(>250)",5,"(>250)","S","(>10)",9,"(>100)",null,null,"OF1T2A",69,69,60,48]
[null,433,10,"(401-450)",10,"(401-450)",8,"(401-450)",11,"(401-450)",1,"(>3)",8,"(401-450)",3,"(>200)",5,"(>250)",5,"(>250)","S","(>10)",9,"(>100)",null,null,"OF1T3A",79,79,69,55]
[null,434,10,"(401-450)",10,"(401-450)",8,"(401-450)",11,"(401-450)",1,"(>3)",8,"(401-450)",3,"(>200)",5,"(>250)",5,"(>250)","S","(>10)",9,"(>100)",null,"OF2","OF2T1A",108,108,94,75]
[null,435,10,"(401-450)",10,"(401-450)",8,"(401-450)",11,"(401-450)",1,"(>3)",8,"(401-450)",3,"(>200)",5,"(>250)",5,"(>250)","S","(>10)",9,"(>100)",null,null,"OF2T2A",145,145,126,101]
[null,436,10,"(401-450)",10,"(401-450)",8,"(401-450)",11,"(401-450)",1,"(>3)",8,"(401-450)",3,"(>200)",5,"(>250)",5,"(>250)","S","(>10)",9,"(>100)",null,null,"OF2T3A",166,166,144,115]
[null,437,10,"(401-450)",10,"(401-450)",8,"(401-450)",11,"(401-450)",1,"(>3)",8,"(401-450)",3,"(>200)",5,"(>250)",5,"(>250)","S","(>10)",9,"(>100)",null,"OF3","OF3T1A",137,137,119,95]
[null,438,10,"(401-450)",10,"(401-450)",8,"(401-450)",11,"(401-450)",1,"(>3)",8,"(401-450)",3,"(>200)",5,"(>250)",5,"(>250)","S","(>10)",9,"(>100)",null,null,"OF3T2A",184,184,160,128]
[null,439,10,"(401-450)",10,"(401-450)",8,"(401-450)",11,"(401-450)",1,"(>3)",8,"(401-450)",3,"(>200)",5,"(>250)",5,"(>250)","S","(>10)",9,"(>100)",null,null,"OF3T3A",208,208,181,145]
[null,440,10,"(401-450)",10,"(401-450)",8,"(401-450)",11,"(401-450)",1,"(>3)",8,"(401-450)",3,"(>200)",5,"(>250)",5,"(>250)","S","(>10)",9,"(>100)",null,"OF4","OF4T1A",155,155,135,108]
[null,441,10,"(401-450)",10,"(401-450)",8,"(401-450)",11,"(401-450)",1,"(>3)",8,"(401-450)",3,"(>200)",5,"(>250)",5,"(>250)","S","(>10)",9,"(>100)",null,null,"OF4T2A",210,210,183,146]
[null,442,10,"(401-450)",10,"(401-450)",8,"(401-450)",11,"(401-450)",1,"(>3)",8,"(401-450)",3,"(>200)",5,"(>250)",5,"(>250)","S","(>10)",9,"(>100)",null,null,"OF4T3A",239,239,208,166]
[null,443,10,"(401-450)",10,"(401-450)",8,"(401-450)",11,"(401-450)",1,"(>3)",8,"(401-450)",3,"(>200)",5,"(>250)",5,"(>250)","S","(>10)",9,"(>100)",null,"OF5","OF5T1A",182,182,158,126]
[null,444,10,"(401-450)",10,"(401-450)",8,"(401-450)",11,"(401-450)",1,"(>3)",8,"(401-450)",3,"(>200)",5,"(>250)",5,"(>250)","S","(>10)",9,"(>100)",null,null,"OF5T2A",245,245,213,170]
[null,445,10,"(401-450)",10,"(401-450)",8,"(401-450)",11,"(401-450)",1,"(>3)",8,"(401-450)",3,"(>200)",5,"(>250)",5,"(>250)","S","(>10)",9,"(>100)",null,null,"OF5T3A",279,279,243,194]
[null,446,10,"(401-450)",10,"(401-450)",8,"(401-450)",11,"(401-450)",1,"(>3)",8,"(401-450)",3,"(>200)",5,"(>250)",5,"(>250)","S","(>10)",9,"(>100)",null,"Exit","ES",29,29,25,20]
[null,447,10,"(401-450)",10,"(401-450)",8,"(401-450)",11,"(401-450)",1,"(>3)",8,"(401-450)",3,"(>200)",5,"(>250)",5,"(>250)","S","(>10)",9,"(>100)"]
[null,448,10,"(401-450)",10,"(401-450)",8,"(401-450)",11,"(401-450)",1,"(>3)",8,"(401-450)",3,"(>200)",5,"(>250)",5,"(>250)","S","(>10)",9,"(>100)"]
[null,449,10,"(401-450)",10,"(401-450)",8,"(401-450)",11,"(401-450)",1,"(>3)",8,"(401-450)",3,"(>200)",5,"(>250)",5,"(>250)","S","(>10)",9,"(>100)"]
[null,450,10,"(401-450)",10,"(401-450)",8,"(401-450)",11,"(401-450)",1,"(>3)",8,"(401-450)",3,"(>200)",5,"(>250)",5,"(>250)","S","(>10)",9,"(>100)"]
[null,451,11,"(>450)",11,"(>450)",9,"(>450)",12,"(>450)",1,"(>3)",9,"(>450)",3,"(>200)",5,"(>250)",5,"(>250)","S","(>10)",9,"(>100)"]
[null,452,11,"(>450)",11,"(>450)",9,"(>450)",12,"(>450)",1,"(>3)",9,"(>450)",3,"(>200)",5,"(>250)",5,"(>250)","S","(>10)",9,"(>100)"]
[null,453,11,"(>450)",11,"(>450)",9,"(>450)",12,"(>450)",1,"(>3)",9,"(>450)",3,"(>200)",5,"(>250)",5,"(>250)","S","(>10)",9,"(>100)"]
[null,454,11,"(>450)",11,"(>450)",9,"(>450)",12,"(>450)",1,"(>3)",9,"(>450)",3,"(>200)",5,"(>250)",5,"(>250)","S","(>10)",9,"(>100)"]
[null,455,11,"(>450)",11,"(>450)",9,"(>450)",12,"(>450)",1,"(>3)",9,"(>450)",3,"(>200)",5,"(>250)",5,"(>250)","S","(>10)",9,"(>100)"]
[null,456,11,"(>450)",11,"(>450)",9,"(>450)",12,"(>450)",1,"(>3)",9,"(>450)",3,"(>200)",5,"(>250)",5,"(>250)","S","(>10)",9,"(>100)"]
[null,457,11,"(>450)",11,"(>450)",9,"(>450)",12,"(>450)",1,"(>3)",9,"(>450)",3,"(>200)",5,"(>250)",5,"(>250)","S","(>10)",9,"(>100)"]
[null,458,11,"(>450)",11,"(>450)",9,"(>450)",{"$f":"C463+1","v":12},{"$f":"D463","v":"(>450)"},1,"(>3)",9,"(>450)",3,"(>200)",5,"(>250)",5,"(>250)","S","(>10)",9,"(>100)"]
[null,459,11,"(>450)",11,"(>450)",9,"(>450)",12,"(>450)",1,"(>3)",9,"(>450)",3,"(>200)",5,"(>250)",5,"(>250)","S","(>10)",9,"(>100)"]
[null,460,11,"(>450)",11,"(>450)",9,"(>450)",12,"(>450)",1,"(>3)",9,"(>450)",3,"(>200)",5,"(>250)",5,"(>250)","S","(>10)",9,"(>100)"]
[null,461,11,"(>450)",11,"(>450)",9,"(>450)",12,"(>450)",1,"(>3)",9,"(>450)",3,"(>200)",5,"(>250)",5,"(>250)","S","(>10)",9,"(>100)"]
[null,462,11,"(>450)",11,"(>450)",9,"(>450)",12,"(>450)",1,"(>3)",9,"(>450)",3,"(>200)",5,"(>250)",5,"(>250)","S","(>10)",9,"(>100)"]
[null,463,11,"(>450)",11,"(>450)",9,"(>450)",12,"(>450)",1,"(>3)",9,"(>450)",3,"(>200)",5,"(>250)",5,"(>250)","S","(>10)",9,"(>100)"]
[null,464,11,"(>450)",11,"(>450)",9,"(>450)",12,"(>450)",1,"(>3)",9,"(>450)",3,"(>200)",5,"(>250)",5,"(>250)","S","(>10)",9,"(>100)"]
[null,465,11,"(>450)",11,"(>450)",9,"(>450)",12,"(>450)",1,"(>3)",9,"(>450)",3,"(>200)",5,"(>250)",5,"(>250)","S","(>10)",9,"(>100)"]
[null,466,11,"(>450)",11,"(>450)",9,"(>450)",12,"(>450)",1,"(>3)",9,"(>450)",3,"(>200)",5,"(>250)",5,"(>250)","S","(>10)",9,"(>100)"]
[null,467,11,"(>450)",11,"(>450)",9,"(>450)",12,"(>450)",1,"(>3)",9,"(>450)",3,"(>200)",5,"(>250)",5,"(>250)","S","(>10)",9,"(>100)"]
[null,468,11,"(>450)",11,"(>450)",9,"(>450)",12,"(>450)",1,"(>3)",9,"(>450)",3,"(>200)",5,"(>250)",5,"(>250)","S","(>10)",9,"(>100)"]
[null,469,11,"(>450)",11,"(>450)",9,"(>450)",12,"(>450)",1,"(>3)",9,"(>450)",3,"(>200)",5,"(>250)",5,"(>250)","S","(>10)",9,"(>100)"]
[null,470,11,"(>450)",11,"(>450)",9,"(>450)",12,"(>450)",1,"(>3)",9,"(>450)",3,"(>200)",5,"(>250)",5,"(>250)","S","(>10)",9,"(>100)"]
[null,471,11,"(>450)",11,"(>450)",9,"(>450)",12,"(>450)",1,"(>3)",9,"(>450)",3,"(>200)",5,"(>250)",5,"(>250)","S","(>10)",9,"(>100)"]
[null,472,11,"(>450)",11,"(>450)",9,"(>450)",12,"(>450)",1,"(>3)",9,"(>450)",3,"(>200)",5,"(>250)",5,"(>250)","S","(>10)",9,"(>100)"]
[null,473,11,"(>450)",11,"(>450)",9,"(>450)",12,"(>450)",1,"(>3)",9,"(>450)",3,"(>200)",5,"(>250)",5,"(>250)","S","(>10)",9,"(>100)"]
[null,474,11,"(>450)",11,"(>450)",9,"(>450)",12,"(>450)",1,"(>3)",9,"(>450)",3,"(>200)",5,"(>250)",5,"(>250)","S","(>10)",9,"(>100)"]
[null,475,11,"(>450)",11,"(>450)",9,"(>450)",12,"(>450)",1,"(>3)",9,"(>450)",3,"(>200)",5,"(>250)",5,"(>250)","S","(>10)",9,"(>100)"]
[null,476,11,"(>450)",11,"(>450)",9,"(>450)",12,"(>450)",1,"(>3)",9,"(>450)",3,"(>200)",5,"(>250)",5,"(>250)","S","(>10)",9,"(>100)"]
[null,477,11,"(>450)",11,"(>450)",9,"(>450)",12,"(>450)",1,"(>3)",9,"(>450)",3,"(>200)",5,"(>250)",5,"(>250)","S","(>10)",9,"(>100)"]
[null,478,11,"(>450)",11,"(>450)",9,"(>450)",12,"(>450)",1,"(>3)",9,"(>450)",3,"(>200)",5,"(>250)",5,"(>250)","S","(>10)",9,"(>100)"]
[null,479,11,"(>450)",11,"(>450)",9,"(>450)",12,"(>450)",1,"(>3)",9,"(>450)",3,"(>200)",5,"(>250)",5,"(>250)","S","(>10)",9,"(>100)"]
[null,480,11,"(>450)",11,"(>450)",9,"(>450)",12,"(>450)",1,"(>3)",9,"(>450)",3,"(>200)",5,"(>250)",5,"(>250)","S","(>10)",9,"(>100)"]
[null,481,11,"(>450)",11,"(>450)",9,"(>450)",12,"(>450)",1,"(>3)",9,"(>450)",3,"(>200)",5,"(>250)",5,"(>250)","S","(>10)",9,"(>100)"]
[null,482,11,"(>450)",11,"(>450)",9,"(>450)",12,"(>450)",1,"(>3)",9,"(>450)",3,"(>200)",5,"(>250)",5,"(>250)","S","(>10)",9,"(>100)"]
[null,483,11,"(>450)",11,"(>450)",9,"(>450)",12,"(>450)",1,"(>3)",9,"(>450)",3,"(>200)",5,"(>250)",5,"(>250)","S","(>10)",9,"(>100)"]
[null,484,11,"(>450)",11,"(>450)",9,"(>450)",12,"(>450)",1,"(>3)",9,"(>450)",3,"(>200)",5,"(>250)",5,"(>250)","S","(>10)",9,"(>100)"]
[null,485,11,"(>450)",11,"(>450)",9,"(>450)",12,"(>450)",1,"(>3)",9,"(>450)",3,"(>200)",5,"(>250)",5,"(>250)","S","(>10)",9,"(>100)"]
[null,486,11,"(>450)",11,"(>450)",9,"(>450)",12,"(>450)",1,"(>3)",9,"(>450)",3,"(>200)",5,"(>250)",5,"(>250)","S","(>10)",9,"(>100)"]
[null,487,11,"(>450)",11,"(>450)",9,"(>450)",12,"(>450)",1,"(>3)",9,"(>450)",3,"(>200)",5,"(>250)",5,"(>250)","S","(>10)",9,"(>100)"]
[null,488,11,"(>450)",11,"(>450)",9,"(>450)",12,"(>450)",1,"(>3)",9,"(>450)",3,"(>200)",5,"(>250)",5,"(>250)","S","(>10)",9,"(>100)"]
[null,489,11,"(>450)",11,"(>450)",9,"(>450)",12,"(>450)",1,"(>3)",9,"(>450)",3,"(>200)",5,"(>250)",5,"(>250)","S","(>10)",9,"(>100)"]
[null,490,11,"(>450)",11,"(>450)",9,"(>450)",12,"(>450)",1,"(>3)",9,"(>450)",3,"(>200)",5,"(>250)",5,"(>250)","S","(>10)",9,"(>100)"]
[null,491,11,"(>450)",11,"(>450)",9,"(>450)",12,"(>450)",1,"(>3)",9,"(>450)",3,"(>200)",5,"(>250)",5,"(>250)","S","(>10)",9,"(>100)"]
[null,492,11,"(>450)",11,"(>450)",9,"(>450)",12,"(>450)",1,"(>3)",9,"(>450)",3,"(>200)",5,"(>250)",5,"(>250)","S","(>10)",9,"(>100)"]
[null,493,11,"(>450)",11,"(>450)",9,"(>450)",12,"(>450)",1,"(>3)",9,"(>450)",3,"(>200)",5,"(>250)",5,"(>250)","S","(>10)",9,"(>100)"]
[null,494,11,"(>450)",11,"(>450)",9,"(>450)",12,"(>450)",1,"(>3)",9,"(>450)",3,"(>200)",5,"(>250)",5,"(>250)","S","(>10)",9,"(>100)"]
[null,495,11,"(>450)",11,"(>450)",9,"(>450)",12,"(>450)",1,"(>3)",9,"(>450)",3,"(>200)",5,"(>250)",5,"(>250)","S","(>10)",9,"(>100)"]
[null,496,11,"(>450)",11,"(>450)",9,"(>450)",12,"(>450)",1,"(>3)",9,"(>450)",3,"(>200)",5,"(>250)",5,"(>250)","S","(>10)",9,"(>100)"]
[null,497,11,"(>450)",11,"(>450)",9,"(>450)",12,"(>450)",1,"(>3)",9,"(>450)",3,"(>200)",5,"(>250)",5,"(>250)","S","(>10)",9,"(>100)"]
[null,498,11,"(>450)",11,"(>450)",9,"(>450)",12,"(>450)",1,"(>3)",9,"(>450)",3,"(>200)",5,"(>250)",5,"(>250)","S","(>10)",9,"(>100)"]
[null,499,11,"(>450)",11,"(>450)",9,"(>450)",12,"(>450)",1,"(>3)",9,"(>450)",3,"(>200)",5,"(>250)",5,"(>250)","S","(>10)",9,"(>100)"]
[null,500,11,"(>450)",11,"(>450)",9,"(>450)",12,"(>450)",1,"(>3)",9,"(>450)",3,"(>200)",5,"(>250)",5,"(>250)","S","(>10)",9,"(>100)"]