{"text_format":"1","workbook":"xlsx","n_sheets":13,"sheets":["Application","Sizing Calculator","Startup Checklist","Error Messages","Photo Requirements","Process & Requirements","LookUps","WSEC Comparison","Area Calculator","Calcs_Heat Loss","Insulation Tables","City Temp Data","NOAA Temp Data"],"not_rendered":{"charts":0,"images":18,"macros":1,"external_links":0,"defined_names":274,"comments":11,"pivot_tables":0},"unopened":[],"bounds":{"document_bytes":16777216,"sheet_cells":100000,"rows_first":2000,"rows_last":500,"rows_between":2000,"halvings":0,"cell_chars":16384,"cell_head_chars":4096},"cells_cut":0,"cells_raw":0,"read":"whole","date_system":"1900"}

{"sheet":"Application","index":0,"n_rows":61,"n_cols":50,"rows_kept":61,"cut":false,"hidden":false,"merged":[[41,3,41,47],[24,43,24,46],[22,4,22,16],[22,17,22,29],[22,30,22,37],[22,38,22,42],[22,43,22,46],[33,4,33,16],[37,43,37,46],[33,17,33,29],[25,39,25,42],[23,4,23,46],[37,23,37,27],[37,29,37,33],[37,35,37,38],[33,30,33,37],[13,44,13,46],[13,19,13,21],[15,35,15,42],[14,43,14,46],[15,43,15,46],[15,29,15,33],[15,23,15,28],[14,23,14,28],[25,4,25,15],[15,4,15,7],[14,4,14,7],[15,8,15,11],[14,8,14,11],[14,12,14,14],[15,12,15,14],[32,3,32,47],[25,43,25,46],[15,15,15,17],[14,15,14,17],[21,3,21,47],[16,4,16,5],[25,35,25,38],[25,17,25,33],[14,19,14,22],[15,19,15,22],[17,4,17,46],[14,29,14,33],[33,38,33,42],[33,43,33,46],[35,43,35,46],[27,43,27,46],[28,4,28,15],[28,17,28,33],[28,35,28,38],[28,39,28,42],[28,43,28,46],[36,17,36,21],[37,39,37,42],[35,4,35,16],[35,30,35,37],[35,38,35,42],[43,31,43,38],[48,3,48,47],[42,4,42,15],[43,4,43,15],[43,25,43,30],[43,16,43,24],[42,39,42,46],[43,39,43,46],[42,31,42,38],[60,27,60,35],[36,43,36,46],[34,4,34,46],[53,8,53,16],[53,17,53,35],[53,36,53,38],[54,8,55,46],[53,39,53,42],[56,27,56,35],[57,27,57,35],[59,27,59,35],[56,37,57,46],[37,4,37,15],[37,17,37,21],[49,4,50,46],[51,4,51,46],[1,45,1,48],[11,35,11,41],[13,22,13,24],[11,26,11,34],[13,4,13,12],[13,13,13,18],[13,26,13,34],[13,35,13,40],[13,41,13,43],[4,3,5,21],[2,3,2,47],[9,3,9,47],[11,42,11,46],[11,4,11,12],[11,20,11,24],[11,13,11,19]]}
[]
[null,"Heating",null,null,null,null,null,null,null,null,null,null,null,null,null,null,null,null,null,null,null,null,null,null,null,null,null,null,null,null,null,null,null,null,null,null,null,null,null,null,null,null,null,null,null,"V Sept 2024"]
[null,null,null,"Energy Services  ●  ce@snopud.com  ●  www.snopud.com/TAResources"]
[]
[null,null,null,"Rebate Application"]
[]
[null,null,null,"For Heating Rebates in Single Family Homes"]
[]
[null,null,null,null,"Customer Information"]
[]
{"$rows_left_out":52}
{"sheet":"Sizing Calculator","index":1,"n_rows":64,"n_cols":14,"rows_kept":64,"cut":false,"hidden":false,"merged":[[26,2,26,11],[4,3,5,6],[60,3,61,10],[56,5,56,6],[7,3,8,10],[55,7,56,10],[49,8,49,10],[50,8,50,10],[55,5,55,6],[32,2,32,11],[48,2,48,11],[54,2,54,11],[49,3,49,4],[49,5,49,6],[50,3,50,4],[50,5,50,6],[1,10,1,12],[2,2,2,11],[5,9,5,11],[11,2,11,11],[18,2,18,11],[12,8,12,9],[13,8,13,9]]}
[]
[null,null,null,null,null,null,null,null,null,null,{"$f":"Application!AT2","v":"V Sept 2024"}]
[null,null,{"$f":"BannerText","v":"Energy Services  ●  ce@snopud.com  ●  www.snopud.com/TAResources"}]
[]
[null,null,null,"Sizing Calculator "]
[null,null,null,null,null,null,null,null,"Homeowner Name:",{"$f":"IF(AppHOName<>\"\",AppHOName,\"\")","v":""}]
[null,null,null,"For Heat Pumps"]
[null,null,null,"This calculator is based on industry standard practices and ACCA Manuals J and S. Please note, this calculator will calculate heating loads only. Fill out all applicable information denoted by the the white input fields. As you work through this form, some values will be automatically calculated for you. If you have any issues filling out this form, please call (425) 229-5598 for assistance. "]
[]
[]
{"$rows_left_out":55}
{"sheet":"Startup Checklist","index":2,"n_rows":68,"n_cols":48,"rows_kept":68,"cut":false,"hidden":false,"merged":[[2,2,2,46],[9,2,9,46],[24,2,24,46],[37,2,37,46],[42,2,42,46],[49,2,49,46],[54,2,54,46],[4,2,5,34],[5,41,5,45],[25,3,25,14],[26,3,26,14],[25,15,25,45],[26,15,26,45],[34,31,34,36],[33,25,33,30],[34,25,34,30],[32,19,32,24],[34,19,34,24],[33,19,33,24],[38,43,38,45],[32,3,32,18],[33,3,33,18],[34,3,34,18],[10,28,10,33],[65,4,65,45],[59,7,59,15],[59,16,59,34],[59,35,59,37],[59,38,59,45],[43,28,43,37],[44,28,44,37],[44,38,44,45],[45,3,46,6],[45,18,45,27],[46,7,46,17],[46,18,46,27],[45,7,45,17],[46,40,46,45],[43,38,43,45],[45,40,45,45],[45,36,45,39],[46,36,46,39],[56,3,56,27],[56,28,56,45],[57,3,57,27],[57,28,57,45],[55,3,55,45],[45,28,45,35],[12,40,12,45],[13,40,13,45],[12,16,12,27],[13,16,13,27],[12,3,12,15],[13,3,13,15],[10,3,10,11],[29,2,29,46],[39,3,39,12],[39,13,39,18],[38,13,38,18],[39,19,39,25],[38,19,38,25],[39,26,39,31],[39,32,39,37],[39,43,39,45],[39,38,39,42],[38,26,38,37],[34,43,34,45],[31,19,31,24],[33,43,33,45],[32,43,32,45],[34,40,34,42],[34,37,34,39],[11,3,11,11],[10,34,10,39],[11,34,11,39],[11,28,11,33],[10,23,10,27],[11,23,11,27],[12,28,12,33],[12,34,12,39],[13,28,13,33],[13,34,13,39],[11,12,11,16],[10,12,10,16],[10,17,10,22],[11,17,11,22],[46,28,46,35],[50,3,50,15],[50,16,50,38],[43,7,43,16],[43,18,43,27],[44,7,44,17],[44,18,44,27],[43,3,44,6],[16,2,16,46],[19,19,19,28],[20,19,20,28],[21,19,21,28],[20,29,20,37],[21,29,21,37],[20,38,20,41],[21,38,21,41],[33,31,33,36],[18,19,18,28],[1,45,1,47],[51,16,51,28],[51,29,51,38],[51,3,51,15],[50,39,50,45],[51,39,51,45],[18,3,18,18],[32,39,32,42],[31,39,31,45],[31,31,31,38],[32,31,32,38],[32,25,32,30],[31,25,31,30],[33,40,33,42],[33,37,33,39],[31,3,31,18],[30,3,30,45],[17,42,21,45],[18,38,18,41],[19,38,19,41],[18,29,18,37],[19,29,19,37],[10,40,10,45],[11,40,11,45]]}
[]
[null,null,null,null,null,null,null,null,null,null,null,null,null,null,null,null,null,null,null,null,null,null,null,null,null,null,null,null,null,null,null,null,null,null,null,null,null,null,null,null,null,null,null,null,null,{"$f":"Application!AT2","v":"V Sept 2024"}]
[null,null,{"$f":"BannerText","v":"Energy Services  ●  ce@snopud.com  ●  www.snopud.com/TAResources"}]
[]
[null,null,"Heat Pump Start-Up Checklist"]
[null,null,null,null,null,null,null,null,null,null,null,null,null,null,null,null,null,null,null,null,null,null,null,null,null,null,null,null,null,null,null,null,null,null,null,null,null,null,null,null,"Homeowner Name:",{"$f":"IF(AppHOName<>\"\",AppHOName,\"\")","v":""}]
[]
[null,null,null,"All applicable sections must be filled out by the contractor at the time of installation. This completed form must be signed by the contractor. Submittal required to receive PUD funding. Keep a copy for your records. "]
[null,null,null,"New Heat Pump Equipment"]
[]
{"$rows_left_out":59}
{"sheet":"Error Messages","index":3,"n_rows":107,"n_cols":11,"rows_kept":107,"cut":false,"hidden":true,"merged":[[0,4,0,6],[0,8,0,10]]}
["These Items Need to be Completed",null,"Checked?",null,"Filter Range",null,null,null,"Filter Results"]
[{"$f":"IF(SubmitCheckTest=TRUE,IF($K2<>\"\",$K2,I2),\"\")","v":""},null,false,null,"Section","Value","Message",null,{"$f":"_xlfn._xlws.FILTER(E3:G106,F3:F106=0,G107)","v":"Name"},0,"Application - Homeowner Name missing"]
[{"$f":"IF(SubmitCheckTest=TRUE,IF($K3<>0,$K3,\"\"),\"\")","v":""},null,null,null,"Name",{"$f":"AppHOName","v":0},"Application - Homeowner Name missing",null,"Email",0,"Application - Homeowner Email Address missing"]
["",null,null,null,"Email",{"$f":"AppHOEmail","v":0},"Application - Homeowner Email Address missing",null,"Phone",0,"Application - Homeowner Phone Number missing"]
["",null,null,null,"Phone",{"$f":"AppHOPhone","v":0},"Application - Homeowner Phone Number missing",null,"Address",0,"Application - Home Installation Address missing"]
["",null,null,null,"Address",{"$f":"AppInstallAddress","v":0},"Application - Home Installation Address missing",null,"City",0,"Application - Home Installation City missing"]
["",null,null,null,"City",{"$f":"AppInstallCity","v":0},"Application - Home Installation City missing",null,"Zip Code",0,"Application - Home Installation Zip Code missing"]
["",null,null,null,"Zip Code",{"$f":"AppInstallZip","v":0},"Application - Home Installation Zip Code missing",null,"Total Sqft",0,"Application - Total Square Footage missing"]
["",null,null,null,"Total Sqft",{"$f":"AppAreaTotal","v":0},"Application - Total Square Footage missing",null,"Treated Sqft",0,"Application - Treated Square Footage missing"]
["",null,null,null,"Treated Sqft",{"$f":"AppAreaTreated","v":0},"Application - Treated Square Footage missing",null,"No. Dwellings",0,"Application - Number of Dwellings missing"]
{"$rows_left_out":98}
{"sheet":"Photo Requirements","index":4,"n_rows":114,"n_cols":6,"rows_kept":114,"cut":false,"hidden":false,"merged":[[90,2,90,6],[111,2,111,6],[2,2,2,6],[4,3,5,3],[10,2,10,6],[33,2,33,6]]}
[]
[]
[null,null,{"$f":"_xlfn.SINGLE(BannerText)","v":"Energy Services  ●  ce@snopud.com  ●  www.snopud.com/TAResources"}]
[]
[null,null,null,"Photo Requirements"]
[]
[null,null,null,"For Heating Rebates in Single Family Homes"]
[]
[null,null,null,"Heat Pumps"]
[null,null,"Nameplates for indoor and outdoor installed equipment (outdoor unit, air handler, indoor units)"]
{"$rows_left_out":105}
{"sheet":"Process & Requirements","index":5,"n_rows":97,"n_cols":3,"rows_kept":97,"cut":false,"hidden":false,"merged":[[2,2,2,17],[4,2,5,8],[79,2,79,16],[81,2,81,16],[96,2,96,17]]}
[]
[]
[null,null,{"$f":"_xlfn.SINGLE(BannerText)","v":"Energy Services  ●  ce@snopud.com  ●  www.snopud.com/TAResources"}]
[]
[null,null,"Process & Requirements"]
[]
[null,null,"For Window Rebates in Single Family Homes"]
[]
[]
[]
{"$rows_left_out":88}
{"sheet":"LookUps","index":6,"n_rows":61,"n_cols":21,"rows_kept":61,"cut":false,"hidden":true,"merged":[[9,4,9,5],[0,16,0,17],[0,18,0,20],[0,4,0,5],[0,2,0,3],[0,8,0,9],[0,10,0,11],[0,12,0,13],[0,14,0,15]]}
["City","Outdoor Design T","Windows",null,"Doors",null,"Attic/Ceiling",null,"Above Grade Walls",null,"Floors",null,"Below Grade Walls",null,"Slab Below Grade",null,"Slab On Grade",null,"Duct Sizing"]
["Arlington",19,"R-Value","U-Factor","R-Value","U-Factor","R-Value","U-Factor","R-Value","U-Factor","R-Value","U-Factor","R-Value","U-Factor","R-Value","F-Factor","R-Value","F-Factor","Size","Supply Side CFM","Return Side CFM"]
["Bothell",21,"Single Pane - Wood Frame",0.96,"Wood Slab in Wood Frame",0.46,"Attic R-7",0.108,"R-0",0.217,"Vented Crawlspace R-0",0.13400000000000001,"2' Below Grade Uninsulated",0.35,{"$f":"M3","v":"2' Below Grade Uninsulated"},0.59,"R-10 ",0.54,"Round 6\"",100,80]
["Brier",21,"Single Pane - Metal Frame",1.1000000000000001,"Wood 25% Glazed-Single",0.57999999999999996,"Attic R-11",8.3000000000000004E-2,"R-7",9.8000000000000004E-2,"Vented Crawlspace R-7",6.9000000000000006E-2,"2' Below Grade R-11 Interior",6.6000000000000003E-2,{"$f":"M4","v":"2' Below Grade R-11 Interior"},0.68,"Uninsulated",0.73,"Round 8\"",200,160]
["Camano Island",22,"Double Pane - Metal Frame",0.75,"Wood 25% Glazed-Double",0.48,"Attic R-15",6.9000000000000006E-2,"R-11",8.3000000000000004E-2,"Vented Crawlspace R-11",5.6000000000000001E-2,"2' Below Grade R-19 Interior",4.2999999999999997E-2,"2' Below Grade R-19 Interior",0.69,null,null,"Round 10\"",360,290]
["Darrington",15,"Double Pane Vinyl or Wood Frame-Clear Glass",0.55000000000000004,"Steel 25% Glazed-Single",0.39,"Attic R-19",4.9000000000000002E-2,"R-19",5.3999999999999999E-2,"Vented Crawlspace R-19",4.1000000000000002E-2,"2' Below Grade R-21 Interior",0.04,"2' Below Grade R-21 Interior",0.68,null,null,"Round 12\"",600,460]
["Edmonds",21,"Double Pane Vinyl or Wood Frame-Low E Glass",0.4,"Steel 25% Glazed-Double",0.28000000000000003,"Attic R-30",3.5999999999999997E-2,"R-21",5.6000000000000001E-2,"Vented Crawlspace R-22",3.6999999999999998E-2,"3.5' Below Grade Uninsulated",0.27800000000000002,"3.5' Below Grade Uninsulated",0.53,null,null,"Round 14\"",900,700]
["Everett",22,"NFRC Rated .22",0.22,"Steel Panel ",0.19,"Attic R-38",3.1E-2,null,null,"Vented Crawlspace R-25",3.4000000000000002E-2,"3.5' Below Grade R-11 Interior",6.2E-2,"3.5' Below Grade R-11 Interior",0.63,null,null,"Round 16\"",1300,1000]
["Everett South (Paine Field)",21,"NFRC Rated .25",0.25,null,null,"Attic R-49",2.7E-2,null,null,"Vented Crawlspace R-30",2.9000000000000001E-2,"3.5' Below Grade R-19 Interior",4.1000000000000002E-2,"3.5' Below Grade R-19 Interior",0.64,null,null,"Round 18\"",1700,1300]
["Gold Bar",21,"NFRC Rated .30",0.3,"Skylights",null,"Attic R-60",2.5000000000000001E-2,null,null,"Vented Crawlspace R-38",2.5000000000000001E-2,"3.5' Below Grade R-21 Interior",3.7999999999999999E-2,"3.5' Below Grade R-21 Interior",0.63,null,null,"Round 20\"",2300,1800]
{"$rows_left_out":52}
{"sheet":"WSEC Comparison","index":7,"n_rows":10,"n_cols":4,"rows_kept":10,"cut":false,"hidden":true,"merged":[]}
["Windows","Original (2015)",2018]
["R-Value","U-Factor","U-Factor"]
["Single Pane - Wood Frame",0.96,1.18]
["Single Pane - Metal Frame",1.1000000000000001,1.58]
["Double Pane - Metal Frame",0.75,1.05]
["Double Pane Vinyl or Wood Frame-Clear Glass",0.55000000000000004,0.84,0.67]
["Double Pane Vinyl or Wood Frame-Low E Glass",0.4,0.73,0.56000000000000005]
["NFRC Rated .22",0.22,"-","-"]
["NFRC Rated .25",0.25,"-","-"]
["NFRC Rated .30",0.3,"-","-"]
{"$rows_left_out":1}
{"sheet":"Area Calculator","index":8,"n_rows":32,"n_cols":46,"rows_kept":32,"cut":false,"hidden":true,"merged":[[40,15,40,18],[41,15,41,18],[42,15,42,18],[43,15,43,18],[44,15,44,18],[0,0,2,3],[23,0,24,3],[38,0,38,3],[39,0,39,3],[40,0,40,3],[41,0,41,3],[42,0,42,3],[43,0,43,3],[44,0,44,3],[5,0,5,3],[30,0,30,3],[31,0,31,3],[32,0,32,3],[33,0,33,3],[34,0,34,3],[35,0,35,3],[36,0,36,3],[37,0,37,3],[31,15,31,18],[32,15,32,18],[33,15,33,18],[34,15,34,18],[35,15,35,18],[36,15,36,18],[37,15,37,18],[38,15,38,18],[39,15,39,18],[31,5,31,7],[32,5,32,7],[33,5,33,7],[34,5,34,7],[35,5,35,7],[36,10,36,13],[37,10,37,13],[38,10,38,13],[39,10,39,13],[31,10,31,13],[32,10,32,13],[33,10,33,13],[34,10,34,13],[35,10,35,13],[36,5,36,7],[37,5,37,7],[38,5,38,7],[39,5,39,7],[40,5,40,7],[40,10,40,13],[46,10,46,13],[47,10,47,13],[48,10,48,13],[41,10,41,13],[42,10,42,13],[43,10,43,13],[45,0,45,3],[46,0,46,3],[47,0,47,3],[48,0,48,3],[41,5,41,7],[42,5,42,7],[43,5,43,7],[44,10,44,13],[45,10,45,13],[46,15,46,18],[47,15,47,18],[48,15,48,18],[45,15,45,18],[47,5,47,7],[48,5,48,7],[44,5,44,7],[45,5,45,7],[46,5,46,7],[35,25,35,26],[36,25,36,26],[37,25,37,26],[38,25,38,26],[39,25,39,26],[30,25,30,26],[31,25,31,26],[32,25,32,26],[33,25,33,26],[34,25,34,26],[45,25,45,26],[46,25,46,26],[47,25,47,26],[48,25,48,26],[40,25,40,26],[41,25,41,26],[42,25,42,26],[43,25,43,26],[44,25,44,26],[19,36,19,37],[20,36,20,37],[21,36,21,37],[15,36,15,37],[16,36,16,37],[20,33,20,34],[21,33,21,34],[30,5,30,7],[30,10,30,13],[30,15,30,18],[5,39,5,41],[5,43,5,45],[15,33,15,34],[16,33,16,34],[17,33,17,34],[18,33,18,34],[19,33,19,34],[10,33,10,34],[11,33,11,34],[12,33,12,34],[13,33,13,34],[14,33,14,34],[5,36,5,37],[6,36,6,37],[7,36,7,37],[8,36,8,37],[9,36,9,37],[10,36,10,37],[11,36,11,37],[12,36,12,37],[13,36,13,37],[14,36,14,37],[17,36,17,37],[18,36,18,37],[5,15,5,18],[5,20,5,23],[5,5,5,8],[5,10,5,13],[5,33,5,34],[6,33,6,34],[7,33,7,34],[8,33,8,34],[9,33,9,34],[5,25,5,27],[5,29,5,31]]}
["Above Grade"]
[null,null,null,null,null,null,null,null,null,null,null,null,null,null,null,null,null,null,null,null,null,null,null,null,null,null,null,null,null,null,null,null,null,"Ceiling Ht (ft)",null,null,"Ceiling Ht (ft)"]
[null,null,null,null,null,null,null,null,null,null,null,null,null,null,null,null,null,null,null,null,null,null,null,null,null,null,null,null,null,null,null,null,null,"Windows Area (ft2)",null,null,"Windows Area (ft2)"]
[null,null,null,null,null,null,null,null,null,null,null,null,null,null,null,null,null,null,null,null,null,null,null,null,null,"Skylight Area (ft2)",null,null,null,"Skylight Area (ft2)",null,null,null,"Doors Area (ft2)",null,null,"Doors Area (ft2)"]
["Windows 1 Area (ft2)",{"$f":"IF(SUM(D8:D22)=0,\"\",ROUND(SUM(D8:D22),0))","v":""},null,null,null,"Windows 2 Area (ft2)",{"$f":"IF(SUM(I7:I22)=0,\"\",ROUND(SUM(I7:I22),0))","v":""},null,null,null,"Skylight Area (ft2)",{"$f":"IF(SUM(N7:N22)=0,\"\",ROUND(SUM(N7:N22),0))","v":""},null,null,null,"Doors 1 Area (ft2)",{"$f":"IF(SUM(S7:S22)=0,\"\",ROUND(SUM(S7:S22),0))","v":""},null,null,null,"Doors 2 Area (ft2)",{"$f":"IF(SUM(X7:X22)=0,\"\",ROUND(SUM(X7:X22),0))","v":""},null,null,null,"Attic 1 Area (ft2)",{"$f":"IF(SUM(AB7:AB22)=0,\"\",ROUND(SUM(AB7:AB22)-AA4,0))","v":""},null,null,"Attic 2 Area (ft2)",{"$f":"IF(SUM(AF7:AF22)=0,\"\",ROUND(SUM(AF7:AF22)-AE4,0))","v":""},null,null,"Above Grade Walls 1 Area (ft2)",{"$f":"IF(SUM(AH8:AH22)=0,\"\",ROUND((SUM(AH8:AH22)*AI2)-AI3-AI4,0))","v":""},null,"Above Grade Walls 2 Area (ft2)",{"$f":"IF(SUM(AK8:AK22)=0,\"\",ROUND((SUM(AK8:AK22)*AL2)-AL3-AL4,0))","v":""},null,"Floors 1 Area (ft2)",{"$f":"IF(SUM(AP7:AP22)=0,\"\",ROUND(SUM(AP7:AP22),0))","v":""},null,null,"Floors 2 Area (ft2)",{"$f":"IF(SUM(AT7:AT22)=0,\"\",ROUND(SUM(AT7:AT22),0))","v":""}]
["Windows Type 1",null,null,null,null,"Windows Type 2",null,null,null,null,"Skylight",null,null,null,null,"Doors Type 1",null,null,null,null,"Doors Type 2",null,null,null,null,"Attic Type 1",null,null,null,"Attic Type 2",null,null,null,"Above Grade Walls Type 1",null,null,"Above Grade Walls Type 2",null,null,"Floors Type 1",null,null,null,"Floors Type 2"]
["Width (ft)","Height (ft)","Qty","Area (ft2)",null,"Width (ft)","Height (ft)","Qty","Area (ft2)",null,"Width (ft)","Height (ft)","Qty","Area (ft2)",null,"Width (ft)","Height (ft)","Qty","Area (ft2)",null,"Width (ft)","Height (ft)","Qty","Area (ft2)",null,"Length 1 (ft)","Length 2 (ft)","Area (ft2)",null,"Length 1 (ft)","Length 2 (ft)","Area (ft2)",null,"Wall Perimeter (ft)",null,null,"Wall Perimeter (ft)",null,null,"Length 1 (ft)","Length 2 (ft)","Area (ft2)",null,"Length 1 (ft)","Length 2 (ft)","Area (ft2)"]
[null,null,null,{"$f":"IF(OR(A8=0,OR(B8=0,C8=\"\")),\"\",A8*B8*C8)","v":""},null,null,null,null,{"$f":"IF(OR(F8=0,OR(G8=0,H8=\"\")),\"\",F8*G8*H8)","v":""},null,null,null,null,{"$f":"IF(OR(K8=0,OR(L8=0,M8=\"\")),\"\",K8*L8*M8)","v":""},null,null,null,null,{"$f":"IF(OR(P8=0,OR(Q8=0,R8=\"\")),\"\",P8*Q8*R8)","v":""},null,null,null,null,{"$f":"IF(OR(U8=0,OR(V8=0,W8=\"\")),\"\",U8*V8*W8)","v":""},null,null,null,{"$f":"IF(OR(Z8=0,AA8=0),\"\",Z8*AA8)","v":""},null,null,null,{"$f":"IF(OR(AD8=0,AE8=0),\"\",AD8*AE8)","v":""},null,null,null,null,null,null,null,null,null,{"$f":"IF(OR(AN8=0,AO8=0),\"\",AN8*AO8)","v":""},null,null,null,{"$f":"IF(OR(AR8=0,AS8=0),\"\",AR8*AS8)","v":""}]
[null,null,null,{"$f":"IF(OR(A9=0,OR(B9=0,C9=\"\")),\"\",A9*B9*C9)","v":""},null,null,null,null,{"$f":"IF(OR(F9=0,OR(G9=0,H9=\"\")),\"\",F9*G9*H9)","v":""},null,null,null,null,{"$f":"IF(OR(K9=0,OR(L9=0,M9=\"\")),\"\",K9*L9*M9)","v":""},null,null,null,null,{"$f":"IF(OR(P9=0,OR(Q9=0,R9=\"\")),\"\",P9*Q9*R9)","v":""},null,null,null,null,{"$f":"IF(OR(U9=0,OR(V9=0,W9=\"\")),\"\",U9*V9*W9)","v":""},null,null,null,{"$f":"IF(OR(Z9=0,AA9=0),\"\",Z9*AA9)","v":""},null,null,null,{"$f":"IF(OR(AD9=0,AE9=0),\"\",AD9*AE9)","v":""},null,null,null,null,null,null,null,null,null,{"$f":"IF(OR(AN9=0,AO9=0),\"\",AN9*AO9)","v":""},null,null,null,{"$f":"IF(OR(AR9=0,AS9=0),\"\",AR9*AS9)","v":""}]
[null,null,null,"",null,null,null,null,"",null,null,null,null,"",null,null,null,null,"",null,null,null,null,"",null,null,null,"",null,null,null,"",null,null,null,null,null,null,null,null,null,"",null,null,null,""]
{"$rows_left_out":23}
{"sheet":"Calcs_Heat Loss","index":9,"n_rows":29,"n_cols":4,"rows_kept":29,"cut":false,"hidden":true,"merged":[[8,0,8,2],[18,0,18,2],[0,0,0,3]]}
["System Info"]
["UA Sum",{"$f":"SUM('Sizing Calculator'!G21:G45) +SUM('Sizing Calculator'!K21:K43)","v":0}]
["Envelope Heat Load ",{"$f":"B2*'Sizing Calculator'!E14","v":{"$error":"#VALUE!"}},"BTU","[UA Sum *Delta T)"]
["Air Leakage Heat Load",{"$f":"'Sizing Calculator'!H14*VLOOKUP('Sizing Calculator'!K14, Infiltration_Lookup,2,0)*'Sizing Calculator'!E14*0.018","v":{"$error":"#VALUE!"}},"BTU","[Delta T*Volume*Infiltration U-Factor*0.018)"]
["Building Heat Load",{"$f":"B4+B3","v":{"$error":"#VALUE!"}},"BTU","[Air Leakage + Envelope Heat Load]"]
["Duct Heat Load",{"$f":"B5*0.08*'Sizing Calculator'!I14","v":{"$error":"#VALUE!"}},"BTU","[Building Heat Load *.08*Ducts in Unconditioned Space ]"]
["Design Heat Load",{"$f":"B6+B5","v":{"$error":"#VALUE!"}},"BTU","[Building and Duct Heat Loss *1.25 for Heat Pump]"]
[]
["Design Heat"]
["Design Heat T1",20,"°F"]
{"$rows_left_out":20}
{"sheet":"Insulation Tables","index":10,"n_rows":25,"n_cols":9,"rows_kept":25,"cut":false,"hidden":true,"merged":[[24,1,24,3],[3,1,3,8],[5,3,5,5],[14,1,14,8],[15,6,22,8]]}
[]
[]
[]
[null,"SITE BUILT HOMES"]
[null,"Year Built","Glazing U-Value","Ceiling","Vaulted Ceiling","Wall Above Grade","Wall Below Grade","Floor","Slab on Grade"]
[null,"Pre-1970",1.2,"Need to verify",null,null,"R-0","R-0","R-0"]
[null,"1970-1977",1.2,"R-11","R-11","R-7","R-0","R-0","R-0"]
[null,"1977-1980",1.2,"R-19","R-11","R-11","R-0","R-0","R-0"]
[null,"1980-1986",0.75,"R-30","R-19","R-11","R-11","R-11","R-0"]
[null,"1987-1990",0.5,"R-38","R-30","R-19","R-19","R-19","R-0"]
{"$rows_left_out":16}
{"sheet":"City Temp Data","index":11,"n_rows":27,"n_cols":8,"rows_kept":27,"cut":false,"hidden":true,"merged":[]}
["City Name","Source Location Name","Design Temp","Source",null,"ASHRAE Location","2017 99% Heating Temp","Source"]
["Arlington","Arlington",19,"NOAA",null,"Arlington Municipal",24.5,"ASHRAE climatic design conditions 2009/2013/2017 (ashrae-meteo.info)"]
["Bothell","Bothell 2 N",21,"NOAA",null,"Darrington 21 NNE",24.7,"ASHRAE climatic design conditions 2009/2013/2017 (ashrae-meteo.info)"]
["Brier","Snohomish County",21,"SBCC",null,"Paine Field (Everett)",28.9,"ASHRAE climatic design conditions 2009/2013/2017 (ashrae-meteo.info)"]
["Camano Island","Coupeville 1 S",22,"NOAA"]
["Darrington","Darrington RS",15,"NOAA",null,"SBCC Location","2018 99% Heating Temp","Source"]
["Edmonds","Snohomish County",21,"SBCC",null,"Snohomish County ",21,"2018 WSEC_R Final package2.pdf (wa.gov)"]
["Everett","Everett JC",22,"NOAA",null,"Darrington RS",13]
["Everett South (Paine Field)","Everett Paine AFB",21,"SBCC",null,"Edmonds",24,"state building code council"]
["Gold Bar","Startup",21,"NOAA",null,"Everett Paine AFB",21]
{"$rows_left_out":18}
{"sheet":"NOAA Temp Data","index":12,"n_rows":9,"n_cols":16,"rows_kept":9,"cut":false,"hidden":true,"merged":[]}
[null,"January","February","March","April","May","June","July","August","September","October","November","December","Annual","Lowest Extreme Min","Average Extreme Min"]
["Arlington",17.53,20.53,24.36,29.29,33.44,39.200000000000003,43.13,43.81,36.380000000000003,28.94,20.53,17.93,12.3,{"$f":"MIN(B2:C2,M2)","v":17.53},{"$f":"AVERAGE(B2,C2,M2)","v":18.663333333333334}]
["Darrington RS",12.5,18.14,23.08,28.12,32,38.56,41.16,41.42,35.799999999999997,28.46,21.34,13.86,7.47,12.5,14.833333333333334]
["Everett JC",19.8,23.32,27.32,31.58,36.51,43.18,46.02,45.45,38.58,31.65,25.49,21.46,14.52,19.8,21.526666666666671]
["Bothell 2 N",13.32,18.399999999999999,22.96,26.7,30.6,36.32,39.22,39.17,32.33,28.57,22.08,19.22,6.83,13.32,16.98]
["Coupeville 1 S",20.57,23.64,27.35,31.7,36.78,41.49,44.54,44.27,38.549999999999997,32.590000000000003,25.78,22.66,15.54,20.57,22.290000000000003]
["Monroe",18.2,21.48,25.35,30.04,34.880000000000003,41.18,44.31,44.03,37.94,30.62,23.56,20.2,12.63,18.2,19.959999999999997]
["Startup",20.09,22.94,26.45,30.14,33.96,39.340000000000003,42.48,42.1,37.479999999999997,30.36,24.93,21.15,14.91,20.09,21.393333333333334]
["Index","-","-",null,null,null,null,null,null,null,null,null,"-",null,"-","-"]